{"text_format":"1","workbook":"xlsx","n_sheets":5,"sheets":["Instructions","Entry Sheet","Holistic Card Print","Result Class 6","Result Class 7"],"not_rendered":{"charts":0,"images":2,"macros":1,"external_links":0,"defined_names":4,"comments":0,"pivot_tables":0},"unopened":[],"bounds":{"document_bytes":16777216,"sheet_cells":100000,"rows_first":2000,"rows_last":500,"rows_between":2000,"halvings":0,"cell_chars":16384,"cell_head_chars":4096},"cells_cut":0,"cells_raw":0,"read":"whole","date_system":"1900"}

{"sheet":"Instructions","index":0,"n_rows":11,"n_cols":12,"rows_kept":11,"cut":false,"hidden":false,"merged":[[0,0,0,5],[5,1,5,5],[7,1,7,6],[8,1,8,6],[9,1,9,6],[2,1,2,5],[3,1,3,6],[4,1,4,6]]}
["Instructions",null,null,null,null,null,null,null,null,null,"Year","Month"]
["Kindly read All Instructions before Use Holistic Card Utitly",null,null,null,null,null,null,null,null,null,2022,"Sept"]
["Note","USE MS office 2010 and Above",null,null,null,null,null,null,null,null,2023,"March"]
[1,"When you see a security warning, select Enable Content"]
[2,"if Still Warning File not Work . Then Close this File.Right-click the file and choose Properties from the context menu.\nAt the bottom of the General tab, select the Unblock checkbox and select OK.",null,null,null,null,null,null,null,null,2024]
[3,"In All Sheet Use only or Click on  Yellow coloured Filled  Cell to Enter or Select Data. Rest Cells Are Locked",null,null,null,null,null,null,null,null,2025]
[4,"Now Goto Entry Sheet. Then Enter Data ( Marks) in Yellow cell thier",null,null,null,null,null,null,null,null,2026]
[5,"you can copy Paste Students Data Like Name ,Father Name, Class Etc.  From Epunjab Student Report Excel File",null,null,null,null,null,null,null,null,2029]
[6,"After Entered All data in yellow cell of  Entry Sheet . Goto Holistic  Card to View/Print report card of each Students",null,null,null,null,null,null,null,null,2030]
[7,"ਤੁਸੀ ਕਿਸੇ ਤਰਾਂ ਦੇ ਸੁਝਾਅ ਅਤੇ ਫੀਡਬੈਕ ਲਈ ਈਮੇਲ abhi072011@gmail.com ਤੇ ਸਪੰਰਕ ਕਰ ਸਕਦੇ ਹੋ"]
[null,"Watch Youtube Video Before Use to Understand "]

{"sheet":"Entry Sheet","index":1,"n_rows":506,"n_cols":174,"rows_kept":506,"cut":false,"hidden":false,"merged":[[0,150,1,160],[3,155,3,160],[0,125,1,134],[3,130,3,134],[3,142,3,147],[0,138,1,147],[3,148,5,148],[3,149,5,149],[2,137,2,149],[2,150,2,162],[0,59,1,68],[0,72,1,80],[0,84,1,94],[0,98,1,108],[0,112,1,121],[3,1,4,2],[2,167,4,169],[4,163,5,163],[4,165,5,165],[4,166,5,166],[3,150,3,154],[3,161,5,161],[3,162,5,162],[4,21,4,32],[4,33,4,44],[3,135,5,135],[3,136,5,136],[3,137,3,141],[3,96,5,96],[3,97,5,97],[3,98,3,102],[3,103,3,109],[3,110,5,110],[3,111,5,111],[3,72,3,76],[3,77,3,81],[3,82,5,82],[3,83,5,83],[3,84,3,88],[3,89,3,95],[3,112,3,116],[3,117,3,122],[3,123,5,123],[3,124,5,124],[3,125,3,129],[3,46,3,50],[3,51,3,56],[3,57,5,57],[3,58,5,58],[3,59,3,63],[2,1,2,2],[2,84,2,97],[2,98,2,111],[2,112,2,124],[2,125,2,136],[2,46,2,58],[1,14,4,20],[1,3,1,13],[0,46,1,55],[1,1,1,2],[1,21,1,32],[3,64,3,69],[3,70,5,70],[3,71,5,71],[2,59,2,71],[2,72,2,83]]}
[null,null,null,null,null,null,null,null,null,null,null,null,null,null,null,null,null,null,null,null,null,null,null,null,null,null,null,null,null,null,null,null,null,null,null,null,null,null,null,null,null,null,null,null,null,null,null,null,null,null,null,null,null,null,null,null,null,null,null,null,null,null,null,null,null,null,null,null,null,null,null,null,null,null,null,null,null,null,null,null,null,null,null,null,null,null,null,null,null,null,null,null,null,null,null,null,null,null,null,null,null,null,null,null,null,null,null,null,null,null,null,null,null,null,null,null,null,null,null,null,null,null,null,null,null,null,null,null,null,null,null,null,null,null,null,null,null,null,null,null,null,null,null,null,null,null,null,null,null,null,"Drawing"]
[null,"ਸਕੂਲ ਦਾ ਨਾਮ ਅਤੇ ਪਤਾ  :  >>",null,"srkwrI hweI skUL",null,null,null,null,null,null,null,null,null,null,null,null,null,null,null,null,null,"Enter No. of  Working Days",null,null,null,null,null,null,null,null,null,null,null,null,null,null,null,null,null,null,null,null,null,null,null,null,null,null,null,null,null,null,null,null,null,null,null,null,null,null,null,null,null,null,null,null,null,null,null,null,null,null,null,null,null,null,null,null,null,null,null,null,null,null,null,null,null,null,null,null,null,null,null,null,null,null,null,null,null,null,null,null,null,null,null,null,null,null,null,null,null,null,null,null,null,null,null,null,null,null,null,null,null,null,null,null,null,null,null,null,null,null,null,null,null,null,null,null,null,null,null,null,null,null,null,null,null,null,null,null,null,null,null,null,null,null,null,null,null,null,null,null,null,null,null,null,null,null,null,null,null,null,null,"ਵਿਭਾਗ ਵੱਲੋਂ ਨਿਸ਼ਚਿਤ ਸਾਰੀਆਂ ਸਹਿ ਅਕਾਦਮਿਕ  ਗਤੀਵਿਧੀਆਂ ਵਿੱਚ ਹਿੱਸਾ ਲਿਆ ਗਿਆ"]
[null,"Udise Code     >>>>",null,0,3,0,9,0,4,0,1,null,null,null,null,null,null,null,null,null,null,"Apr","May","Jul","Aug","Sep","Oct","Nov","Dec","Jan","Feb","Mar","Total",null,null,null,null,null,null,null,null,null,null,null,null,null,"SUBJECT PUNJABI  ",null,null,null,null,null,null,null,null,null,null,null,null,"SUBJECT HINDI",null,null,null,null,null,null,null,null,null,null,null,null,"SUBJECT ENGLISH",null,null,null,null,null,null,null,null,null,null,null,"SUBJECT MATHEMATICS",null,null,null,null,null,null,null,null,null,null,null,null,null,"SUBJECT SCIENCE",null,null,null,null,null,null,null,null,null,null,null,null,null,"SUBJECT SOCIAL SCIENCE",null,null,null,null,null,null,null,null,null,null,null,null,"SUBJECT COMPUTER SCIENCE",null,null,null,null,null,null,null,null,null,null,null,"SUBJECT PHYSICAL",null,null,null,null,null,null,null,null,null,null,null,null,"SUBJECT ELECTIVE",null,null,null,null,null,null,null,null,null,null,null,null,null,null,null,null,"participation of student in co-curricular/ extra-curricular activities and sports at School / Block / District / State level",null,null,null,null,null,"ਵਿਦਿਆਰਥੀਆਂ ਵੱਲੋਂ ਹਰ ਪ੍ਰਤੀਯੋਗਤਾ ਅਤੇ ਸਹਿ- ਕਿਰਿਆ ਵਿੱਚ ਸ਼ਾਨਦਾਰ ਪ੍ਰਦਰਸ਼ਨ ਕੀਤਾ ਗਿਆ"]
[null,"Only Fill Yellow Cells",null,null,null,null,null,null,null,null,null,null,null,null,null,null,null,null,null,null,null,25,30,30,30,30,30,30,30,30,30,30,{"$f":"SUM(V4:AF4)","v":325},null,null,null,null,null,null,null,null,null,null,null,null,null,"EXAM MARKS",null,null,null,null," CCE/INA MARKS",null,null,null,null,null,"PBI TOTAL (100)","GRADE","EXAM MARKS",null,null,null,null," CCE/INA MARKS",null,null,null,null,null,"HINDI TOTAL (100)","GRADE","EXAM MARKS",null,null,null,null," CCE/INA MARKS",null,null,null,null,"HINDI TOTAL (100)","GRADE","EXAM MARKS",null,null,null,null," CCE/INA MARKS",null,null,null,null,null,null," TOTAL (100)","GRADE","EXAM MARKS",null,null,null,null," CCE/INA MARKS",null,null,null,null,null,null,"SCI TOTAL (100)","GRADE","EXAM MARKS",null,null,null,null," CCE/INA MARKS",null,null,null,null,null,"SS TOTAL (100)","GRADE","EXAM MARKS",null,null,null,null," CCE/INA MARKS /Practical",null,null,null,null,"CS TOTAL (100)","GRADE","EXAM MARKS",null,null,null,null," CCE/INA MARKS",null,null,null,null,null,"PHYSICAL TOTAL (100)","GRADE","EXAM MARKS",null,null,null,null," CCE/INA MARKS",null,null,null,null,null," TOTAL (100)","GRADE",null,null,null,null,null,null,null,null,null,null,"ਖੇਡਾਂ ਸਬੰਧੀ ਸਾਰੀ ਗਤੀਵਿਧੀਆਂ ਵਿੱਚ ਬਲਾਕ, ਜਿਲਾ, ਰਾਜ ਪੱਧਰੀ ਤੇ ਵਿਚ ਭਾਗ ਲਿਆ ਲੈ ਕੇ ਪੁਜੀਸ਼ਨਾਂ ਹਾਸਿਲ ਕੀਤੀਆਂ ਗਈਆਂ"]
[null,null,null,null,null,null,null,null,null,null,null,null,null,null,null,null,null,null,null,null,null,"No. of Days Attended  Montly by student",null,null,null,null,null,null,null,null,null,null,null," % of  Attendace   Montly by student",null,null,null,null,null,null,null,null,null,null,null,null,20,80,20,80,80,6,3,3,7,1,20,null,null,20,80,20,80,80,6,3,3,7,1,20,null,null,20,80,20,80,80,10,2,2,6,20,null,null,20,80,20,80,80,10,2,2,2,2,2,20,null,null,20,80,20,80,80,10,2,2,2,2,2,20,null,null,20,80,20,80,80,4,5,4,1,6,20,null,null,20,40,20,40,40,8,8,4,20,40,null,null,20,40,20,40,40,3,2,4,1,10,50,null,null,20,80,20,80,80,10,5,4,1,20,null,null,null,"GRAND TOTAL (MAIN SUB)",null,"Total Grade","Pass/Fail",null,null,null,null,null,null,"ਪ੍ਰਤੀਯੋਗਤਾ ਪ੍ਰੀਖਿਆ ਪ੍ਰੀਖਿਆ ਲਈ NMMS /PSTSE ਵਿਦਿਆਰਥੀਆਂ ਵੱਲੋਂ ਵੱਧ  ਕੇ ਹਿੱਸਾ ਲਿਆ ਗਿਆ"]
[null,"Sr. NO.","ਨਾਮ:","ਰੋਲ ਨੰਬਰ :","ਦਾਖਲਾ ਨੰ:","ਜਮਾਤ:","Section","ਜਨਮ ਮਿਤੀ ","ਪਤਾ","Phone","Mother Name","Mother Qulaification","Mother Occupation","Father Name","Father Qulaification","Father Occupation","No. of Siblings","Sibling's Age","Mother Tongue","Medium","Rural /Urban","Apr","May","Jul","Aug","Sep","Oct","Nov","Dec","Jan","Feb","Mar","Total","Apr","May","Jul","Aug","Sep","Oct","Nov","Dec","Jan","Feb","Mar","Total","75% LESS","Bi monthly -I","Term Exam -1","Bi monthly-II","Term II /\nPre-Board","Final","Practical / Project /Assignment","Performance, Cooperation and Discipline ","Pre-Board/ Term Exam","Dictation and Creative Writing","Book Bank","Total ",null,null,"Bi monthly -I","Term Exam -1","Bi monthly-II","Term II /\nPre-Board","Final","Practical / Project /Assignment","Performance, Cooperation and Discipline ","Pre-Board/ Term Exam","Dictation and Creative Writing","Book Bank","Total ",null,null,"Bi monthly -I","Term Exam -1","Bi monthly-II","Term II /\nPre-Board","Final","Practical / Project Work/Assignment","Student Performance, Cooperation and Discipline\n","Pre-Board/ Term Exam","Notebook/Assignment/  Participation in tests","Total ",null,null,"Bi monthly -I","Term Exam -1","Bi monthly-II","Term II /\nPre-Board","Final","Practical / Project Work/Assignment","Student Performance, Cooperation and Discipline\nin class","Pre-Board/ Term Exam","Concept Clarity  and Model Presentation in Activity\n","Correlation of activity with daily life in Activity Fair","Care of copies, Handwriting and Deposit of Old\nBooks ","Total ",null,null,"Bi monthly -I","Term Exam -1","Bi monthly-II","Term II /\nPre-Board","Final","Practical / Project Work/Assignment","Student Performance, Cooperation and Discipline\nin class","Pre-Board/ Term Exam","Concept Clarity  and Model Presentation in Activity\n","Correlation of activity with daily life in Activity Fair","Care of copies, Handwriting and Deposit of Old\nBooks ","Total ",null,null,"Bi monthly -I","Term Exam -1","Bi monthly-II","Term II /\nPre-Board","Final","Term Exam/Bimonthly Tests","Pre Board","Interest in subject,\n(Home Work/ Note Book/Work Book)","Book Bank","Project work / Activities (  Movements (1885-1919)","Total ",null,null,"Bi monthly -I","Term Exam -1","Bi monthly-II","Term II /\nPre-Board","Final","Student Performance, Cooperation and Discipline","Pre-Board/ Term Exam","Care of copies,  and Deposit of Old Books ","Total ","Practical",null,null,"Bi monthly -I","Term Exam -1","Bi monthly-II","Term II /\nPre-Board","Final","Practical / Project Work/Assignment","Student Performance, Cooperation and Discipline ","Pre-Board/ Term Exam","Care of copies, Handwriting and Deposit of Old Book","Total ","Practical",null,null,"Bi monthly -I","Term Exam -1","Bi monthly-II","Term II /\nPre-Board","Final","Practical / Project Work/Assignment","Student Performance, Cooperation and Discipline ","Pre-Board/ Term Exam","Care of copies, Handwriting and Deposit of Old Book","Total ","Practical",null,null,null,"% Age of Total",null,null,"Term1","Term 2","Annual ",null,null,null,"ਵਿਦਿਆਰਥੀਆਂ ਵੱਲੋਂ ਹਾਊਸ ਇੰਚਾਰਜ ਵੱਲੋਂ ਦਿੱਤੀ ਗਈ ਗਤੀਵਿਧੀਆਂ ਵਿੱਚ ਬਾਕਮਾਲ ਕੰਮ ਕੀਤਾ ਗਿਆ"]
[null,1,"Ram",1,null,"6th",null,"2000-10-17",null,987654321,"sonI ","10vI",null,"rwm","5vI.","lybr",1,10,null,null,"Rural",24,23,26,24,21,21,5,21,24,26,16,{"$f":"SUM(V7:AF7)","v":231},{"$f":"V7/$V$4","v":0.96},{"$f":"W7/$W$4","v":0.76666666666666672},{"$f":"X7/$X$4","v":0.8666666666666667},{"$f":"Y7/$Y$4","v":0.8},{"$f":"Z7/$Z$4","v":0.7},{"$f":"AA7/$AA$4","v":0.7},{"$f":"AB7/$AB$4","v":0.16666666666666666},{"$f":"AC7/$AC$4","v":0.7},{"$f":"AD7/$AD$4","v":0.8},{"$f":"AE7/$AE$4","v":0.8666666666666667},{"$f":"AF7/$AF$4","v":0.53333333333333333},{"$f":"AG7/$AG$4","v":0.71076923076923082},null,null,null,null,null,80,6,3,3,7,1,{"$f":"SUM(AZ7:BD7)","v":20},{"$f":"BE7+AY7","v":100},{"$f":"IFERROR(IF(BF7>90,\"A+\",IF(BF7>80,\"A\",IF(BF7>70,\"B+\",IF(BF7>60,\"B\",IF(BF7>50,\"C+\",IF(BF7>40,\"C\",IF(BF7>=33,\"D\",\"E\"))))))),\"Abs\")","v":"A+"},20,80,20,80,80,6,3,3,7,1,{"$f":"SUM(BM7:BQ7)","v":20},{"$f":"BR7+BL7","v":100},{"$f":"IFERROR(IF(BS7>90,\"A+\",IF(BS7>80,\"A\",IF(BS7>70,\"B+\",IF(BS7>60,\"B\",IF(BS7>50,\"C+\",IF(BS7>40,\"C\",IF(BS7>=33,\"D\",\"E\"))))))),\"Abs\")","v":"A+"},20,80,20,80,80,10,2,2,6,{"$f":"SUM(BZ7:CC7)","v":20},{"$f":"CD7+BY7","v":100},{"$f":"IFERROR(IF(CE7>90,\"A+\",IF(CE7>80,\"A\",IF(CE7>70,\"B+\",IF(CE7>60,\"B\",IF(CE7>50,\"C+\",IF(CE7>40,\"C\",IF(CE7>=33,\"D\",\"E\"))))))),\"Abs\")","v":"A+"},20,80,20,80,80,10,2,2,2,2,2,{"$f":"SUM(CL7:CQ7)","v":20},{"$f":"CR7+CK7","v":100},{"$f":"IFERROR(IF(CS7>90,\"A+\",IF(CS7>80,\"A\",IF(CS7>70,\"B+\",IF(CS7>60,\"B\",IF(CS7>50,\"C+\",IF(CS7>40,\"C\",IF(CS7>=33,\"D\",\"E\"))))))),\"Abs\")","v":"A+"},20,80,20,80,80,10,2,2,2,2,2,{"$f":"SUM(CZ7:DE7)","v":20},{"$f":"DF7+CY7","v":100},{"$f":"IFERROR(IF(DG7>90,\"A+\",IF(DG7>80,\"A\",IF(DG7>70,\"B+\",IF(DG7>60,\"B\",IF(DG7>50,\"C+\",IF(DG7>40,\"C\",IF(DG7>=33,\"D\",\"E\"))))))),\"Abs\")","v":"A+"},20,80,20,80,80,4,5,4,1,6,{"$f":"SUM(DN7:DR7)","v":20},{"$f":"DS7+DM7","v":100},{"$f":"IFERROR(IF(DT7>90,\"A+\",IF(DT7>80,\"A\",IF(DT7>70,\"B+\",IF(DT7>60,\"B\",IF(DT7>50,\"C+\",IF(DT7>40,\"C\",IF(DT7>=33,\"D\",\"E\"))))))),\"Abs\")","v":"A+"},20,40,20,40,40,8,8,4,{"$f":"SUM(EA7:EC7)","v":20},40,{"$f":"EE7+ED7+DZ7","v":100},{"$f":"IFERROR(IF(EF7>90,\"A+\",IF(EF7>80,\"A\",IF(EF7>70,\"B+\",IF(EF7>60,\"B\",IF(EF7>50,\"C+\",IF(EF7>40,\"C\",IF(EF7>=33,\"D\",\"E\"))))))),\"Abs\")","v":"A+"},20,40,20,40,40,3,2,4,1,{"$f":"SUM(EM7:EP7)","v":10},50,{"$f":"ER7+EQ7+EL7","v":100},{"$f":"IFERROR(IF(ES7>90,\"A+\",IF(ES7>80,\"A\",IF(ES7>70,\"B+\",IF(ES7>60,\"B\",IF(ES7>50,\"C+\",IF(ES7>40,\"C\",IF(ES7>=33,\"D\",\"E\"))))))),\"Abs\")","v":"A+"},20,80,20,80,80,10,5,4,1,{"$f":"SUM(EZ7:FC7)","v":20},10,{"$f":"FE7+FD7+EY7","v":110},{"$f":"IFERROR(IF(FF7>90,\"A+\",IF(FF7>80,\"A\",IF(FF7>70,\"B+\",IF(FF7>60,\"B\",IF(FF7>50,\"C+\",IF(FF7>40,\"C\",IF(FF7>=33,\"D\",\"E\"))))))),\"Abs\")","v":"A+"},{"$f":"IF(AND(MIN(AY7,BL7,BY7,CK7,CY7,DM7)>19,MIN(BF7,BS7,CE7,CS7,DG7,DT7)>32),SUM(BF7,BS7,CE7,CS7,DG7,DT7),\"---\")","v":600},{"$f":"IFERROR(FH7/600*100,\"ERR\")","v":100},{"$f":"IF(FI7=\"ERR\",\"\",(IF(FI7>90,\"A+\",IF(FI7>80,\"A\",IF(FI7>70,\"B+\",IF(FI7>60,\"B\",IF(FI7>50,\"C+\",IF(FI7>40,\"C\",IF(FI7>=33,\"D\",IF(FI7<33,\"E\",\"\"))))))))))","v":"A+"},{"$f":"IF(FI7=\"ERR\",\"----\",IF(FI7>=33,\"ਪਾਸ\",\"--\"))","v":"ਪਾਸ"},"ਵਿਭਾਗ ਵੱਲੋਂ ਨਿਸ਼ਚਿਤ ਸਾਰੀਆਂ ਸਹਿ ਅਕਾਦਮਿਕ  ਗਤੀਵਿਧੀਆਂ ਵਿੱਚ ਹਿੱਸਾ ਲਿਆ ਗਿਆ","ਵਿਦਿਆਰਥੀਆਂ ਵੱਲੋਂ ਹਰ ਪ੍ਰਤੀਯੋਗਤਾ ਅਤੇ ਸਹਿ- ਕਿਰਿਆ ਵਿੱਚ ਸ਼ਾਨਦਾਰ ਪ੍ਰਦਰਸ਼ਨ ਕੀਤਾ ਗਿਆ","ਵਿਭਾਗ ਵੱਲੋਂ ਨਿਸ਼ਚਿਤ ਸਾਰੀਆਂ ਸਹਿ ਅਕਾਦਮਿਕ  ਗਤੀਵਿਧੀਆਂ ਵਿੱਚ ਹਿੱਸਾ ਲਿਆ ਗਿਆ",null,null,null,"ਬੱਚਿਆਂ ਵੱਲੋਂ ਸਾਲ ਵਿੱਚ ਹਰ ਮਹੱਤਵਪੂਰਨ ਦਿਨ ਤੇ ਪੋਸਟਰ ਡਿਬੇਟ ਕੁਇਜ਼ ਚਾਰਟ ਮਾਡਲ ਵਿੱਚ ਭਾਗ ਲਿਆ ਗਿਆ।"]
[null,2,"sham",2,null,"7th",null,"2001-10-01",null,123456789,"sIqMU","8vI",null,"kulj","AnpV",null,1,10,null,null,"Rural",23,19,16,17,18,23,null,null,null,null,null,{"$f":"SUM(V8:AF8)","v":116},{"$f":"V8/$V$4","v":0.92},{"$f":"W8/$W$4","v":0.6333333333333333},{"$f":"X8/$X$4","v":0.53333333333333333},{"$f":"Y8/$Y$4","v":0.56666666666666665},{"$f":"Z8/$Z$4","v":0.6},{"$f":"AA8/$AA$4","v":0.76666666666666672},{"$f":"AB8/$AB$4","v":0},{"$f":"AC8/$AC$4","v":0},{"$f":"AD8/$AD$4","v":0},{"$f":"AE8/$AE$4","v":0},{"$f":"AF8/$AF$4","v":0},{"$f":"AG8/$AG$4","v":0.3569230769230769},null,null,null,null,null,null,null,null,null,null,null,{"$f":"SUM(AZ8:BD8)","v":0},{"$f":"BE8+AY8","v":0},{"$f":"IFERROR(IF(BF8>90,\"A+\",IF(BF8>80,\"A\",IF(BF8>70,\"B+\",IF(BF8>60,\"B\",IF(BF8>50,\"C+\",IF(BF8>40,\"C\",IF(BF8>=33,\"D\",\"E\"))))))),\"Abs\")","v":"E"},null,null,null,null,null,null,null,null,null,null,{"$f":"SUM(BM8:BQ8)","v":0},{"$f":"BR8+BL8","v":0},{"$f":"IFERROR(IF(BS8>90,\"A+\",IF(BS8>80,\"A\",IF(BS8>70,\"B+\",IF(BS8>60,\"B\",IF(BS8>50,\"C+\",IF(BS8>40,\"C\",IF(BS8>=33,\"D\",\"E\"))))))),\"Abs\")","v":"E"},null,null,null,null,null,null,null,null,null,{"$f":"SUM(BZ8:CC8)","v":0},{"$f":"CD8+BY8","v":0},{"$f":"IFERROR(IF(CE8>90,\"A+\",IF(CE8>80,\"A\",IF(CE8>70,\"B+\",IF(CE8>60,\"B\",IF(CE8>50,\"C+\",IF(CE8>40,\"C\",IF(CE8>=33,\"D\",\"E\"))))))),\"Abs\")","v":"E"},null,null,null,null,null,null,null,null,null,null,null,{"$f":"SUM(CL8:CQ8)","v":0},{"$f":"CR8+CK8","v":0},{"$f":"IFERROR(IF(CS8>90,\"A+\",IF(CS8>80,\"A\",IF(CS8>70,\"B+\",IF(CS8>60,\"B\",IF(CS8>50,\"C+\",IF(CS8>40,\"C\",IF(CS8>=33,\"D\",\"E\"))))))),\"Abs\")","v":"E"},null,null,null,null,null,null,null,null,null,null,null,{"$f":"SUM(CZ8:DE8)","v":0},{"$f":"DF8+CY8","v":0},{"$f":"IFERROR(IF(DG8>90,\"A+\",IF(DG8>80,\"A\",IF(DG8>70,\"B+\",IF(DG8>60,\"B\",IF(DG8>50,\"C+\",IF(DG8>40,\"C\",IF(DG8>=33,\"D\",\"E\"))))))),\"Abs\")","v":"E"},null,null,null,null,null,null,null,null,null,null,{"$f":"SUM(DN8:DR8)","v":0},{"$f":"DS8+DM8","v":0},{"$f":"IFERROR(IF(DT8>90,\"A+\",IF(DT8>80,\"A\",IF(DT8>70,\"B+\",IF(DT8>60,\"B\",IF(DT8>50,\"C+\",IF(DT8>40,\"C\",IF(DT8>=33,\"D\",\"E\"))))))),\"Abs\")","v":"E"},null,null,null,null,null,null,null,null,{"$f":"SUM(EA8:EC8)","v":0},null,{"$f":"EE8+ED8+DZ8","v":0},{"$f":"IFERROR(IF(EF8>90,\"A+\",IF(EF8>80,\"A\",IF(EF8>70,\"B+\",IF(EF8>60,\"B\",IF(EF8>50,\"C+\",IF(EF8>40,\"C\",IF(EF8>=33,\"D\",\"E\"))))))),\"Abs\")","v":"E"},null,null,null,null,null,null,null,null,null,{"$f":"SUM(EM8:EP8)","v":0},null,{"$f":"ER8+EQ8+EL8","v":0},{"$f":"IFERROR(IF(ES8>90,\"A+\",IF(ES8>80,\"A\",IF(ES8>70,\"B+\",IF(ES8>60,\"B\",IF(ES8>50,\"C+\",IF(ES8>40,\"C\",IF(ES8>=33,\"D\",\"E\"))))))),\"Abs\")","v":"E"},null,null,null,null,null,null,null,null,null,{"$f":"SUM(EZ8:FC8)","v":0},null,{"$f":"FE8+FD8+EY8","v":0},{"$f":"IFERROR(IF(FF8>90,\"A+\",IF(FF8>80,\"A\",IF(FF8>70,\"B+\",IF(FF8>60,\"B\",IF(FF8>50,\"C+\",IF(FF8>40,\"C\",IF(FF8>=33,\"D\",\"E\"))))))),\"Abs\")","v":"E"},{"$f":"IF(AND(MIN(AY8,BL8,BY8,CK8,CY8,DM8)>19,MIN(BF8,BS8,CE8,CS8,DG8,DT8)>32),SUM(BF8,BS8,CE8,CS8,DG8,DT8),\"---\")","v":"---"},{"$f":"IFERROR(FH8/600*100,\"ERR\")","v":"ERR"},{"$f":"IF(FI8=\"ERR\",\"\",(IF(FI8>90,\"A+\",IF(FI8>80,\"A\",IF(FI8>70,\"B+\",IF(FI8>60,\"B\",IF(FI8>50,\"C+\",IF(FI8>40,\"C\",IF(FI8>=33,\"D\",IF(FI8<33,\"E\",\"\"))))))))))","v":""},{"$f":"IF(FI8=\"ERR\",\"----\",IF(FI8>=33,\"ਪਾਸ\",\"--\"))","v":"----"},null,null,null,null,null,null,"ਸਾਇੰਸ, ਗਣਿਤ ,ਸ. ਸ, ਅੰਗਰੇਜੀ ਮੇਲਿਆ ਦੌਰਾਨ ਬੱਚਿਆਂ ਦੇ ਸਗਰਮ ਭੂਮਿਕਾ ਨਿਭਾਈ"]
[null,3,null,3,null,null,null,null,null,null,null,null,null,null,null,null,1,10,null,null,"Rural",null,null,null,null,null,null,null,null,null,null,null,0,0,0,0,0,0,0,0,0,0,0,0,0,null,null,null,null,null,null,null,null,null,null,null,0,0,"E",null,null,null,null,null,null,null,null,null,null,0,0,"E",null,null,null,null,null,null,null,null,null,0,0,"E",null,null,null,null,null,null,null,null,null,null,null,0,0,"E",null,null,null,null,null,null,null,null,null,null,null,0,0,"E",null,null,null,null,null,null,null,null,null,null,0,0,"E",null,null,null,null,null,null,null,null,0,null,0,"E",null,null,null,null,null,null,null,null,null,0,null,0,"E",null,null,null,null,null,null,null,null,null,0,null,0,"E","---","ERR","","----",null,null,null,null,null,null,"ਬੱਚਿਆਂ ਵੱਲੋਂ ਸਕੂਲ ਨੂੰ ਸਾਫ ਰੱਖਣਾ ਰੁੱਖ ਲਗਾਉਣਾ ਵਾਤਾਵਰਨ ਬਚਾਉਣ ਸਬੰਧੀ ਉਪਰਾਲੇ ਕੀਤੇ ਗਏ"]
[null,4,null,null,null,null,null,null,null,null,null,null,null,null,null,null,1,10,null,null,null,null,null,null,null,null,null,null,null,null,null,null,0,0,0,0,0,0,0,0,0,0,0,0,0,null,null,null,null,null,null,null,null,null,null,null,0,0,"E",null,null,null,null,null,null,null,null,null,null,0,0,"E",null,null,null,null,null,null,null,null,null,0,0,"E",null,null,null,null,null,null,null,null,null,null,null,0,0,"E",null,null,null,null,null,null,null,null,null,null,null,0,0,"E",null,null,null,null,null,null,null,null,null,null,0,0,"E",null,null,null,null,null,null,null,null,0,null,0,"E",null,null,null,null,null,null,null,null,null,0,null,0,"E",null,null,null,null,null,null,null,null,null,0,null,0,"E","---","ERR","","----"]
[null,5,null,null,null,null,null,null,null,null,null,null,null,null,null,null,null,null,null,null,null,null,null,null,null,null,null,null,null,null,null,null,0,0,0,0,0,0,0,0,0,0,0,0,0,null,null,null,null,null,null,null,null,null,null,null,0,0,"E",null,null,null,null,null,null,null,null,null,null,0,0,"E",null,null,null,null,null,null,null,null,null,0,0,"E",null,null,null,null,null,null,null,null,null,null,null,0,0,"E",null,null,null,null,null,null,null,null,null,null,null,0,0,"E",null,null,null,null,null,null,null,null,null,null,0,0,"E",null,null,null,null,null,null,null,null,0,null,0,"E",null,null,null,null,null,null,null,null,null,0,null,0,"E",null,null,null,null,null,null,null,null,null,0,null,0,"E","---","ERR","","----"]
[null,6,null,null,null,null,null,null,null,null,null,null,null,null,null,null,null,null,null,null,null,null,null,null,null,null,null,null,null,null,null,null,0,0,0,0,0,0,0,0,0,0,0,0,0,null,null,null,null,null,null,null,null,null,null,null,0,0,"E",null,null,null,null,null,null,null,null,null,null,0,0,"E",null,null,null,null,null,null,null,null,null,0,0,"E",null,null,null,null,null,null,null,null,null,null,null,0,0,"E",null,null,null,null,null,null,null,null,null,null,null,0,0,"E",null,null,null,null,null,null,null,null,null,null,0,0,"E",null,null,null,null,null,null,null,null,0,null,0,"E",null,null,null,null,null,null,null,null,null,0,null,0,"E",null,null,null,null,null,null,null,null,null,0,null,0,"E","---","ERR","","----"]
[null,7,null,null,null,null,null,null,null,null,null,null,null,null,null,null,null,null,null,null,null,null,null,null,null,null,null,null,null,null,null,null,0,0,0,0,0,0,0,0,0,0,0,0,0,null,null,null,null,null,null,null,null,null,null,null,0,0,"E",null,null,null,null,null,null,null,null,null,null,0,0,"E",null,null,null,null,null,null,null,null,null,0,0,"E",null,null,null,null,null,null,null,null,null,null,null,0,0,"E",null,null,null,null,null,null,null,null,null,null,null,0,0,"E",null,null,null,null,null,null,null,null,null,null,0,0,"E",null,null,null,null,null,null,null,null,0,null,0,"E",null,null,null,null,null,null,null,null,null,0,null,0,"E",null,null,null,null,null,null,null,null,null,0,null,0,"E","---","ERR","","----"]
[null,8,null,null,null,null,null,null,null,null,null,null,null,null,null,null,null,null,null,null,null,null,null,null,null,null,null,null,null,null,null,null,0,0,0,0,0,0,0,0,0,0,0,0,0,null,null,null,null,null,null,null,null,null,null,null,0,0,"E",null,null,null,null,null,null,null,null,null,null,0,0,"E",null,null,null,null,null,null,null,null,null,0,0,"E",null,null,null,null,null,null,null,null,null,null,null,0,0,"E",null,null,null,null,null,null,null,null,null,null,null,0,0,"E",null,null,null,null,null,null,null,null,null,null,0,0,"E",null,null,null,null,null,null,null,null,0,null,0,"E",null,null,null,null,null,null,null,null,null,0,null,0,"E",null,null,null,null,null,null,null,null,null,0,null,0,"E","---","ERR","","----"]
[null,9,null,null,null,null,null,null,null,null,null,null,null,null,null,null,null,null,null,null,null,null,null,null,null,null,null,null,null,null,null,null,0,0,0,0,0,0,0,0,0,0,0,0,0,null,null,null,null,null,null,null,null,null,null,null,0,0,"E",null,null,null,null,null,null,null,null,null,null,0,0,"E",null,null,null,null,null,null,null,null,null,0,0,"E",null,null,null,null,null,null,null,null,null,null,null,0,0,"E",null,null,null,null,null,null,null,null,null,null,null,0,0,"E",null,null,null,null,null,null,null,null,null,null,0,0,"E",null,null,null,null,null,null,null,null,0,null,0,"E",null,null,null,null,null,null,null,null,null,0,null,0,"E",null,null,null,null,null,null,null,null,null,0,null,0,"E","---","ERR","","----"]
[null,10,null,null,null,null,null,null,null,null,null,null,null,null,null,null,null,null,null,null,null,null,null,null,null,null,null,null,null,null,null,null,0,0,0,0,0,0,0,0,0,0,0,0,0,null,null,null,null,null,null,null,null,null,null,null,0,0,"E",null,null,null,null,null,null,null,null,null,null,0,0,"E",null,null,null,null,null,null,null,null,null,0,0,"E",null,null,null,null,null,null,null,null,null,null,null,0,0,"E",null,null,null,null,null,null,null,null,null,null,null,0,0,"E",null,null,null,null,null,null,null,null,null,null,0,0,"E",null,null,null,null,null,null,null,null,0,null,0,"E",null,null,null,null,null,null,null,null,null,0,null,0,"E",null,null,null,null,null,null,null,null,null,0,null,0,"E","---","ERR","","----"]
[null,11,null,null,null,null,null,null,null,null,null,null,null,null,null,null,null,null,null,null,null,null,null,null,null,null,null,null,null,null,null,null,0,0,0,0,0,0,0,0,0,0,0,0,0,null,null,null,null,null,null,null,null,null,null,null,0,0,"E",null,null,null,null,null,null,null,null,null,null,0,0,"E",null,null,null,null,null,null,null,null,null,0,0,"E",null,null,null,null,null,null,null,null,null,null,null,0,0,"E",null,null,null,null,null,null,null,null,null,null,null,0,0,"E",null,null,null,null,null,null,null,null,null,null,0,0,"E",null,null,null,null,null,null,null,null,0,null,0,"E",null,null,null,null,null,null,null,null,null,0,null,0,"E",null,null,null,null,null,null,null,null,null,0,null,0,"E","---","ERR","","----"]
[null,12,null,null,null,null,null,null,null,null,null,null,null,null,null,null,null,null,null,null,null,null,null,null,null,null,null,null,null,null,null,null,0,0,0,0,0,0,0,0,0,0,0,0,0,null,null,null,null,null,null,null,null,null,null,null,0,0,"E",null,null,null,null,null,null,null,null,null,null,0,0,"E",null,null,null,null,null,null,null,null,null,0,0,"E",null,null,null,null,null,null,null,null,null,null,null,0,0,"E",null,null,null,null,null,null,null,null,null,null,null,0,0,"E",null,null,null,null,null,null,null,null,null,null,0,0,"E",null,null,null,null,null,null,null,null,0,null,0,"E",null,null,null,null,null,null,null,null,null,0,null,0,"E",null,null,null,null,null,null,null,null,null,0,null,0,"E","---","ERR","","----"]
[null,13,null,null,null,null,null,null,null,null,null,null,null,null,null,null,null,null,null,null,null,null,null,null,null,null,null,null,null,null,null,null,0,0,0,0,0,0,0,0,0,0,0,0,0,null,null,null,null,null,null,null,null,null,null,null,0,0,"E",null,null,null,null,null,null,null,null,null,null,0,0,"E",null,null,null,null,null,null,null,null,null,0,0,"E",null,null,null,null,null,null,null,null,null,null,null,0,0,"E",null,null,null,null,null,null,null,null,null,null,null,0,0,"E",null,null,null,null,null,null,null,null,null,null,0,0,"E",null,null,null,null,null,null,null,null,0,null,0,"E",null,null,null,null,null,null,null,null,null,0,null,0,"E",null,null,null,null,null,null,null,null,null,0,null,0,"E","---","ERR","","----"]
[null,14,null,null,null,null,null,null,null,null,null,null,null,null,null,null,null,null,null,null,null,null,null,null,null,null,null,null,null,null,null,null,0,0,0,0,0,0,0,0,0,0,0,0,0,null,null,null,null,null,null,null,null,null,null,null,0,0,"E",null,null,null,null,null,null,null,null,null,null,0,0,"E",null,null,null,null,null,null,null,null,null,0,0,"E",null,null,null,null,null,null,null,null,null,null,null,0,0,"E",null,null,null,null,null,null,null,null,null,null,null,0,0,"E",null,null,null,null,null,null,null,null,null,null,0,0,"E",null,null,null,null,null,null,null,null,0,null,0,"E",null,null,null,null,null,null,null,null,null,0,null,0,"E",null,null,null,null,null,null,null,null,null,0,null,0,"E","---","ERR","","----"]
[null,15,null,null,null,null,null,null,null,null,null,null,null,null,null,null,null,null,null,null,null,null,null,null,null,null,null,null,null,null,null,null,0,0,0,0,0,0,0,0,0,0,0,0,0,null,null,null,null,null,null,null,null,null,null,null,0,0,"E",null,null,null,null,null,null,null,null,null,null,0,0,"E",null,null,null,null,null,null,null,null,null,0,0,"E",null,null,null,null,null,null,null,null,null,null,null,0,0,"E",null,null,null,null,null,null,null,null,null,null,null,0,0,"E",null,null,null,null,null,null,null,null,null,null,0,0,"E",null,null,null,null,null,null,null,null,0,null,0,"E",null,null,null,null,null,null,null,null,null,0,null,0,"E",null,null,null,null,null,null,null,null,null,0,null,0,"E","---","ERR","","----"]
[null,16,null,null,null,null,null,null,null,null,null,null,null,null,null,null,null,null,null,null,null,null,null,null,null,null,null,null,null,null,null,null,0,0,0,0,0,0,0,0,0,0,0,0,0,null,null,null,null,null,null,null,null,null,null,null,0,0,"E",null,null,null,null,null,null,null,null,null,null,0,0,"E",null,null,null,null,null,null,null,null,null,0,0,"E",null,null,null,null,null,null,null,null,null,null,null,0,0,"E",null,null,null,null,null,null,null,null,null,null,null,0,0,"E",null,null,null,null,null,null,null,null,null,null,0,0,"E",null,null,null,null,null,null,null,null,0,null,0,"E",null,null,null,null,null,null,null,null,null,0,null,0,"E",null,null,null,null,null,null,null,null,null,0,null,0,"E","---","ERR","","----"]
[null,17,null,null,null,null,null,null,null,null,null,null,null,null,null,null,null,null,null,null,null,null,null,null,null,null,null,null,null,null,null,null,0,0,0,0,0,0,0,0,0,0,0,0,0,null,null,null,null,null,null,null,null,null,null,null,0,0,"E",null,null,null,null,null,null,null,null,null,null,0,0,"E",null,null,null,null,null,null,null,null,null,0,0,"E",null,null,null,null,null,null,null,null,null,null,null,0,0,"E",null,null,null,null,null,null,null,null,null,null,null,0,0,"E",null,null,null,null,null,null,null,null,null,null,0,0,"E",null,null,null,null,null,null,null,null,0,null,0,"E",null,null,null,null,null,null,null,null,null,0,null,0,"E",null,null,null,null,null,null,null,null,null,0,null,0,"E","---","ERR","","----"]
[null,18,null,null,null,null,null,null,null,null,null,null,null,null,null,null,null,null,null,null,null,null,null,null,null,null,null,null,null,null,null,null,0,0,0,0,0,0,0,0,0,0,0,0,0,null,null,null,null,null,null,null,null,null,null,null,0,0,"E",null,null,null,null,null,null,null,null,null,null,0,0,"E",null,null,null,null,null,null,null,null,null,0,0,"E",null,null,null,null,null,null,null,null,null,null,null,0,0,"E",null,null,null,null,null,null,null,null,null,null,null,0,0,"E",null,null,null,null,null,null,null,null,null,null,0,0,"E",null,null,null,null,null,null,null,null,0,null,0,"E",null,null,null,null,null,null,null,null,null,0,null,0,"E",null,null,null,null,null,null,null,null,null,0,null,0,"E","---","ERR","","----"]
[null,19,null,null,null,null,null,null,null,null,null,null,null,null,null,null,null,null,null,null,null,null,null,null,null,null,null,null,null,null,null,null,0,0,0,0,0,0,0,0,0,0,0,0,0,null,null,null,null,null,null,null,null,null,null,null,0,0,"E",null,null,null,null,null,null,null,null,null,null,0,0,"E",null,null,null,null,null,null,null,null,null,0,0,"E",null,null,null,null,null,null,null,null,null,null,null,0,0,"E",null,null,null,null,null,null,null,null,null,null,null,0,0,"E",null,null,null,null,null,null,null,null,null,null,0,0,"E",null,null,null,null,null,null,null,null,0,null,0,"E",null,null,null,null,null,null,null,null,null,0,null,0,"E",null,null,null,null,null,null,null,null,null,0,null,0,"E","---","ERR","","----"]
[null,20,null,null,null,null,null,null,null,null,null,null,null,null,null,null,null,null,null,null,null,null,null,null,null,null,null,null,null,null,null,null,0,0,0,0,0,0,0,0,0,0,0,0,0,null,null,null,null,null,null,null,null,null,null,null,0,0,"E",null,null,null,null,null,null,null,null,null,null,0,0,"E",null,null,null,null,null,null,null,null,null,0,0,"E",null,null,null,null,null,null,null,null,null,null,null,0,0,"E",null,null,null,null,null,null,null,null,null,null,null,0,0,"E",null,null,null,null,null,null,null,null,null,null,0,0,"E",null,null,null,null,null,null,null,null,0,null,0,"E",null,null,null,null,null,null,null,null,null,0,null,0,"E",null,null,null,null,null,null,null,null,null,0,null,0,"E","---","ERR","","----"]
[null,21,null,null,null,null,null,null,null,null,null,null,null,null,null,null,null,null,null,null,null,null,null,null,null,null,null,null,null,null,null,null,0,0,0,0,0,0,0,0,0,0,0,0,0,null,null,null,null,null,null,null,null,null,null,null,0,0,"E",null,null,null,null,null,null,null,null,null,null,0,0,"E",null,null,null,null,null,null,null,null,null,0,0,"E",null,null,null,null,null,null,null,null,null,null,null,0,0,"E",null,null,null,null,null,null,null,null,null,null,null,0,0,"E",null,null,null,null,null,null,null,null,null,null,0,0,"E",null,null,null,null,null,null,null,null,0,null,0,"E",null,null,null,null,null,null,null,null,null,0,null,0,"E",null,null,null,null,null,null,null,null,null,0,null,0,"E","---","ERR","","----"]
[null,22,null,null,null,null,null,null,null,null,null,null,null,null,null,null,null,null,null,null,null,null,null,null,null,null,null,null,null,null,null,null,0,0,0,0,0,0,0,0,0,0,0,0,0,null,null,null,null,null,null,null,null,null,null,null,0,0,"E",null,null,null,null,null,null,null,null,null,null,0,0,"E",null,null,null,null,null,null,null,null,null,0,0,"E",null,null,null,null,null,null,null,null,null,null,null,0,0,"E",null,null,null,null,null,null,null,null,null,null,null,0,0,"E",null,null,null,null,null,null,null,null,null,null,0,0,"E",null,null,null,null,null,null,null,null,0,null,0,"E",null,null,null,null,null,null,null,null,null,0,null,0,"E",null,null,null,null,null,null,null,null,null,0,null,0,"E","---","ERR","","----"]
[null,23,null,null,null,null,null,null,null,null,null,null,null,null,null,null,null,null,null,null,null,null,null,null,null,null,null,null,null,null,null,null,0,0,0,0,0,0,0,0,0,0,0,0,0,null,null,null,null,null,null,null,null,null,null,null,0,0,"E",null,null,null,null,null,null,null,null,null,null,0,0,"E",null,null,null,null,null,null,null,null,null,0,0,"E",null,null,null,null,null,null,null,null,null,null,null,0,0,"E",null,null,null,null,null,null,null,null,null,null,null,0,0,"E",null,null,null,null,null,null,null,null,null,null,0,0,"E",null,null,null,null,null,null,null,null,0,null,0,"E",null,null,null,null,null,null,null,null,null,0,null,0,"E",null,null,null,null,null,null,null,null,null,0,null,0,"E","---","ERR","","----"]
[null,24,null,null,null,null,null,null,null,null,null,null,null,null,null,null,null,null,null,null,null,null,null,null,null,null,null,null,null,null,null,null,0,0,0,0,0,0,0,0,0,0,0,0,0,null,null,null,null,null,null,null,null,null,null,null,0,0,"E",null,null,null,null,null,null,null,null,null,null,0,0,"E",null,null,null,null,null,null,null,null,null,0,0,"E",null,null,null,null,null,null,null,null,null,null,null,0,0,"E",null,null,null,null,null,null,null,null,null,null,null,0,0,"E",null,null,null,null,null,null,null,null,null,null,0,0,"E",null,null,null,null,null,null,null,null,0,null,0,"E",null,null,null,null,null,null,null,null,null,0,null,0,"E",null,null,null,null,null,null,null,null,null,0,null,0,"E","---","ERR","","----"]
[null,25,null,null,null,null,null,null,null,null,null,null,null,null,null,null,null,null,null,null,null,null,null,null,null,null,null,null,null,null,null,null,0,0,0,0,0,0,0,0,0,0,0,0,0,null,null,null,null,null,null,null,null,null,null,null,0,0,"E",null,null,null,null,null,null,null,null,null,null,0,0,"E",null,null,null,null,null,null,null,null,null,0,0,"E",null,null,null,null,null,null,null,null,null,null,null,0,0,"E",null,null,null,null,null,null,null,null,null,null,null,0,0,"E",null,null,null,null,null,null,null,null,null,null,0,0,"E",null,null,null,null,null,null,null,null,0,null,0,"E",null,null,null,null,null,null,null,null,null,0,null,0,"E",null,null,null,null,null,null,null,null,null,0,null,0,"E","---","ERR","","----"]
[null,26,null,null,null,null,null,null,null,null,null,null,null,null,null,null,null,null,null,null,null,null,null,null,null,null,null,null,null,null,null,null,0,0,0,0,0,0,0,0,0,0,0,0,0,null,null,null,null,null,null,null,null,null,null,null,0,0,"E",null,null,null,null,null,null,null,null,null,null,0,0,"E",null,null,null,null,null,null,null,null,null,0,0,"E",null,null,null,null,null,null,null,null,null,null,null,0,0,"E",null,null,null,null,null,null,null,null,null,null,null,0,0,"E",null,null,null,null,null,null,null,null,null,null,0,0,"E",null,null,null,null,null,null,null,null,0,null,0,"E",null,null,null,null,null,null,null,null,null,0,null,0,"E",null,null,null,null,null,null,null,null,null,0,null,0,"E","---","ERR","","----"]
[null,27,null,null,null,null,null,null,null,null,null,null,null,null,null,null,null,null,null,null,null,null,null,null,null,null,null,null,null,null,null,null,0,0,0,0,0,0,0,0,0,0,0,0,0,null,null,null,null,null,null,null,null,null,null,null,0,0,"E",null,null,null,null,null,null,null,null,null,null,0,0,"E",null,null,null,null,null,null,null,null,null,0,0,"E",null,null,null,null,null,null,null,null,null,null,null,0,0,"E",null,null,null,null,null,null,null,null,null,null,null,0,0,"E",null,null,null,null,null,null,null,null,null,null,0,0,"E",null,null,null,null,null,null,null,null,0,null,0,"E",null,null,null,null,null,null,null,null,null,0,null,0,"E",null,null,null,null,null,null,null,null,null,0,null,0,"E","---","ERR","","----"]
[null,28,null,null,null,null,null,null,null,null,null,null,null,null,null,null,null,null,null,null,null,null,null,null,null,null,null,null,null,null,null,null,0,0,0,0,0,0,0,0,0,0,0,0,0,null,null,null,null,null,null,null,null,null,null,null,0,0,"E",null,null,null,null,null,null,null,null,null,null,0,0,"E",null,null,null,null,null,null,null,null,null,0,0,"E",null,null,null,null,null,null,null,null,null,null,null,0,0,"E",null,null,null,null,null,null,null,null,null,null,null,0,0,"E",null,null,null,null,null,null,null,null,null,null,0,0,"E",null,null,null,null,null,null,null,null,0,null,0,"E",null,null,null,null,null,null,null,null,null,0,null,0,"E",null,null,null,null,null,null,null,null,null,0,null,0,"E","---","ERR","","----"]
[null,29,null,null,null,null,null,null,null,null,null,null,null,null,null,null,null,null,null,null,null,null,null,null,null,null,null,null,null,null,null,null,0,0,0,0,0,0,0,0,0,0,0,0,0,null,null,null,null,null,null,null,null,null,null,null,0,0,"E",null,null,null,null,null,null,null,null,null,null,0,0,"E",null,null,null,null,null,null,null,null,null,0,0,"E",null,null,null,null,null,null,null,null,null,null,null,0,0,"E",null,null,null,null,null,null,null,null,null,null,null,0,0,"E",null,null,null,null,null,null,null,null,null,null,0,0,"E",null,null,null,null,null,null,null,null,0,null,0,"E",null,null,null,null,null,null,null,null,null,0,null,0,"E",null,null,null,null,null,null,null,null,null,0,null,0,"E","---","ERR","","----"]
[null,30,null,null,null,null,null,null,null,null,null,null,null,null,null,null,null,null,null,null,null,null,null,null,null,null,null,null,null,null,null,null,0,0,0,0,0,0,0,0,0,0,0,0,0,null,null,null,null,null,null,null,null,null,null,null,0,0,"E",null,null,null,null,null,null,null,null,null,null,0,0,"E",null,null,null,null,null,null,null,null,null,0,0,"E",null,null,null,null,null,null,null,null,null,null,null,0,0,"E",null,null,null,null,null,null,null,null,null,null,null,0,0,"E",null,null,null,null,null,null,null,null,null,null,0,0,"E",null,null,null,null,null,null,null,null,0,null,0,"E",null,null,null,null,null,null,null,null,null,0,null,0,"E",null,null,null,null,null,null,null,null,null,0,null,0,"E","---","ERR","","----"]
[null,31,null,null,null,null,null,null,null,null,null,null,null,null,null,null,null,null,null,null,null,null,null,null,null,null,null,null,null,null,null,null,0,0,0,0,0,0,0,0,0,0,0,0,0,null,null,null,null,null,null,null,null,null,null,null,0,0,"E",null,null,null,null,null,null,null,null,null,null,0,0,"E",null,null,null,null,null,null,null,null,null,0,0,"E",null,null,null,null,null,null,null,null,null,null,null,0,0,"E",null,null,null,null,null,null,null,null,null,null,null,0,0,"E",null,null,null,null,null,null,null,null,null,null,0,0,"E",null,null,null,null,null,null,null,null,0,null,0,"E",null,null,null,null,null,null,null,null,null,0,null,0,"E",null,null,null,null,null,null,null,null,null,0,null,0,"E","---","ERR","","----"]
[null,32,null,null,null,null,null,null,null,null,null,null,null,null,null,null,null,null,null,null,null,null,null,null,null,null,null,null,null,null,null,null,0,0,0,0,0,0,0,0,0,0,0,0,0,null,null,null,null,null,null,null,null,null,null,null,0,0,"E",null,null,null,null,null,null,null,null,null,null,0,0,"E",null,null,null,null,null,null,null,null,null,0,0,"E",null,null,null,null,null,null,null,null,null,null,null,0,0,"E",null,null,null,null,null,null,null,null,null,null,null,0,0,"E",null,null,null,null,null,null,null,null,null,null,0,0,"E",null,null,null,null,null,null,null,null,0,null,0,"E",null,null,null,null,null,null,null,null,null,0,null,0,"E",null,null,null,null,null,null,null,null,null,0,null,0,"E","---","ERR","","----"]
[null,33,null,null,null,null,null,null,null,null,null,null,null,null,null,null,null,null,null,null,null,null,null,null,null,null,null,null,null,null,null,null,0,0,0,0,0,0,0,0,0,0,0,0,0,null,null,null,null,null,null,null,null,null,null,null,0,0,"E",null,null,null,null,null,null,null,null,null,null,0,0,"E",null,null,null,null,null,null,null,null,null,0,0,"E",null,null,null,null,null,null,null,null,null,null,null,0,0,"E",null,null,null,null,null,null,null,null,null,null,null,0,0,"E",null,null,null,null,null,null,null,null,null,null,0,0,"E",null,null,null,null,null,null,null,null,0,null,0,"E",null,null,null,null,null,null,null,null,null,0,null,0,"E",null,null,null,null,null,null,null,null,null,0,null,0,"E","---","ERR","","----"]
[null,34,null,null,null,null,null,null,null,null,null,null,null,null,null,null,null,null,null,null,null,null,null,null,null,null,null,null,null,null,null,null,0,0,0,0,0,0,0,0,0,0,0,0,0,null,null,null,null,null,null,null,null,null,null,null,0,0,"E",null,null,null,null,null,null,null,null,null,null,0,0,"E",null,null,null,null,null,null,null,null,null,0,0,"E",null,null,null,null,null,null,null,null,null,null,null,0,0,"E",null,null,null,null,null,null,null,null,null,null,null,0,0,"E",null,null,null,null,null,null,null,null,null,null,0,0,"E",null,null,null,null,null,null,null,null,0,null,0,"E",null,null,null,null,null,null,null,null,null,0,null,0,"E",null,null,null,null,null,null,null,null,null,0,null,0,"E","---","ERR","","----"]
[null,35,null,null,null,null,null,null,null,null,null,null,null,null,null,null,null,null,null,null,null,null,null,null,null,null,null,null,null,null,null,null,0,0,0,0,0,0,0,0,0,0,0,0,0,null,null,null,null,null,null,null,null,null,null,null,0,0,"E",null,null,null,null,null,null,null,null,null,null,0,0,"E",null,null,null,null,null,null,null,null,null,0,0,"E",null,null,null,null,null,null,null,null,null,null,null,0,0,"E",null,null,null,null,null,null,null,null,null,null,null,0,0,"E",null,null,null,null,null,null,null,null,null,null,0,0,"E",null,null,null,null,null,null,null,null,0,null,0,"E",null,null,null,null,null,null,null,null,null,0,null,0,"E",null,null,null,null,null,null,null,null,null,0,null,0,"E","---","ERR","","----"]
[null,36,null,null,null,null,null,null,null,null,null,null,null,null,null,null,null,null,null,null,null,null,null,null,null,null,null,null,null,null,null,null,0,0,0,0,0,0,0,0,0,0,0,0,0,null,null,null,null,null,null,null,null,null,null,null,0,0,"E",null,null,null,null,null,null,null,null,null,null,0,0,"E",null,null,null,null,null,null,null,null,null,0,0,"E",null,null,null,null,null,null,null,null,null,null,null,0,0,"E",null,null,null,null,null,null,null,null,null,null,null,0,0,"E",null,null,null,null,null,null,null,null,null,null,0,0,"E",null,null,null,null,null,null,null,null,0,null,0,"E",null,null,null,null,null,null,null,null,null,0,null,0,"E",null,null,null,null,null,null,null,null,null,0,null,0,"E","---","ERR","","----"]
[null,37,null,null,null,null,null,null,null,null,null,null,null,null,null,null,null,null,null,null,null,null,null,null,null,null,null,null,null,null,null,null,0,0,0,0,0,0,0,0,0,0,0,0,0,null,null,null,null,null,null,null,null,null,null,null,0,0,"E",null,null,null,null,null,null,null,null,null,null,0,0,"E",null,null,null,null,null,null,null,null,null,0,0,"E",null,null,null,null,null,null,null,null,null,null,null,0,0,"E",null,null,null,null,null,null,null,null,null,null,null,0,0,"E",null,null,null,null,null,null,null,null,null,null,0,0,"E",null,null,null,null,null,null,null,null,0,null,0,"E",null,null,null,null,null,null,null,null,null,0,null,0,"E",null,null,null,null,null,null,null,null,null,0,null,0,"E","---","ERR","","----"]
[null,38,null,null,null,null,null,null,null,null,null,null,null,null,null,null,null,null,null,null,null,null,null,null,null,null,null,null,null,null,null,null,0,0,0,0,0,0,0,0,0,0,0,0,0,null,null,null,null,null,null,null,null,null,null,null,0,0,"E",null,null,null,null,null,null,null,null,null,null,0,0,"E",null,null,null,null,null,null,null,null,null,0,0,"E",null,null,null,null,null,null,null,null,null,null,null,0,0,"E",null,null,null,null,null,null,null,null,null,null,null,0,0,"E",null,null,null,null,null,null,null,null,null,null,0,0,"E",null,null,null,null,null,null,null,null,0,null,0,"E",null,null,null,null,null,null,null,null,null,0,null,0,"E",null,null,null,null,null,null,null,null,null,0,null,0,"E","---","ERR","","----"]
[null,39,null,null,null,null,null,null,null,null,null,null,null,null,null,null,null,null,null,null,null,null,null,null,null,null,null,null,null,null,null,null,0,0,0,0,0,0,0,0,0,0,0,0,0,null,null,null,null,null,null,null,null,null,null,null,0,0,"E",null,null,null,null,null,null,null,null,null,null,0,0,"E",null,null,null,null,null,null,null,null,null,0,0,"E",null,null,null,null,null,null,null,null,null,null,null,0,0,"E",null,null,null,null,null,null,null,null,null,null,null,0,0,"E",null,null,null,null,null,null,null,null,null,null,0,0,"E",null,null,null,null,null,null,null,null,0,null,0,"E",null,null,null,null,null,null,null,null,null,0,null,0,"E",null,null,null,null,null,null,null,null,null,0,null,0,"E","---","ERR","","----"]
[null,40,null,null,null,null,null,null,null,null,null,null,null,null,null,null,null,null,null,null,null,null,null,null,null,null,null,null,null,null,null,null,0,0,0,0,0,0,0,0,0,0,0,0,0,null,null,null,null,null,null,null,null,null,null,null,0,0,"E",null,null,null,null,null,null,null,null,null,null,0,0,"E",null,null,null,null,null,null,null,null,null,0,0,"E",null,null,null,null,null,null,null,null,null,null,null,0,0,"E",null,null,null,null,null,null,null,null,null,null,null,0,0,"E",null,null,null,null,null,null,null,null,null,null,0,0,"E",null,null,null,null,null,null,null,null,0,null,0,"E",null,null,null,null,null,null,null,null,null,0,null,0,"E",null,null,null,null,null,null,null,null,null,0,null,0,"E","---","ERR","","----"]
[null,41,null,null,null,null,null,null,null,null,null,null,null,null,null,null,null,null,null,null,null,null,null,null,null,null,null,null,null,null,null,null,0,0,0,0,0,0,0,0,0,0,0,0,0,null,null,null,null,null,null,null,null,null,null,null,0,0,"E",null,null,null,null,null,null,null,null,null,null,0,0,"E",null,null,null,null,null,null,null,null,null,0,0,"E",null,null,null,null,null,null,null,null,null,null,null,0,0,"E",null,null,null,null,null,null,null,null,null,null,null,0,0,"E",null,null,null,null,null,null,null,null,null,null,0,0,"E",null,null,null,null,null,null,null,null,0,null,0,"E",null,null,null,null,null,null,null,null,null,0,null,0,"E",null,null,null,null,null,null,null,null,null,0,null,0,"E","---","ERR","","----"]
[null,42,null,null,null,null,null,null,null,null,null,null,null,null,null,null,null,null,null,null,null,null,null,null,null,null,null,null,null,null,null,null,0,0,0,0,0,0,0,0,0,0,0,0,0,null,null,null,null,null,null,null,null,null,null,null,0,0,"E",null,null,null,null,null,null,null,null,null,null,0,0,"E",null,null,null,null,null,null,null,null,null,0,0,"E",null,null,null,null,null,null,null,null,null,null,null,0,0,"E",null,null,null,null,null,null,null,null,null,null,null,0,0,"E",null,null,null,null,null,null,null,null,null,null,0,0,"E",null,null,null,null,null,null,null,null,0,null,0,"E",null,null,null,null,null,null,null,null,null,0,null,0,"E",null,null,null,null,null,null,null,null,null,0,null,0,"E","---","ERR","","----"]
[null,43,null,null,null,null,null,null,null,null,null,null,null,null,null,null,null,null,null,null,null,null,null,null,null,null,null,null,null,null,null,null,0,0,0,0,0,0,0,0,0,0,0,0,0,null,null,null,null,null,null,null,null,null,null,null,0,0,"E",null,null,null,null,null,null,null,null,null,null,0,0,"E",null,null,null,null,null,null,null,null,null,0,0,"E",null,null,null,null,null,null,null,null,null,null,null,0,0,"E",null,null,null,null,null,null,null,null,null,null,null,0,0,"E",null,null,null,null,null,null,null,null,null,null,0,0,"E",null,null,null,null,null,null,null,null,0,null,0,"E",null,null,null,null,null,null,null,null,null,0,null,0,"E",null,null,null,null,null,null,null,null,null,0,null,0,"E","---","ERR","","----"]
[null,44,null,null,null,null,null,null,null,null,null,null,null,null,null,null,null,null,null,null,null,null,null,null,null,null,null,null,null,null,null,null,0,0,0,0,0,0,0,0,0,0,0,0,0,null,null,null,null,null,null,null,null,null,null,null,0,0,"E",null,null,null,null,null,null,null,null,null,null,0,0,"E",null,null,null,null,null,null,null,null,null,0,0,"E",null,null,null,null,null,null,null,null,null,null,null,0,0,"E",null,null,null,null,null,null,null,null,null,null,null,0,0,"E",null,null,null,null,null,null,null,null,null,null,0,0,"E",null,null,null,null,null,null,null,null,0,null,0,"E",null,null,null,null,null,null,null,null,null,0,null,0,"E",null,null,null,null,null,null,null,null,null,0,null,0,"E","---","ERR","","----"]
[null,45,null,null,null,null,null,null,null,null,null,null,null,null,null,null,null,null,null,null,null,null,null,null,null,null,null,null,null,null,null,null,0,0,0,0,0,0,0,0,0,0,0,0,0,null,null,null,null,null,null,null,null,null,null,null,0,0,"E",null,null,null,null,null,null,null,null,null,null,0,0,"E",null,null,null,null,null,null,null,null,null,0,0,"E",null,null,null,null,null,null,null,null,null,null,null,0,0,"E",null,null,null,null,null,null,null,null,null,null,null,0,0,"E",null,null,null,null,null,null,null,null,null,null,0,0,"E",null,null,null,null,null,null,null,null,0,null,0,"E",null,null,null,null,null,null,null,null,null,0,null,0,"E",null,null,null,null,null,null,null,null,null,0,null,0,"E","---","ERR","","----"]
[null,46,null,null,null,null,null,null,null,null,null,null,null,null,null,null,null,null,null,null,null,null,null,null,null,null,null,null,null,null,null,null,0,0,0,0,0,0,0,0,0,0,0,0,0,null,null,null,null,null,null,null,null,null,null,null,0,0,"E",null,null,null,null,null,null,null,null,null,null,0,0,"E",null,null,null,null,null,null,null,null,null,0,0,"E",null,null,null,null,null,null,null,null,null,null,null,0,0,"E",null,null,null,null,null,null,null,null,null,null,null,0,0,"E",null,null,null,null,null,null,null,null,null,null,0,0,"E",null,null,null,null,null,null,null,null,0,null,0,"E",null,null,null,null,null,null,null,null,null,0,null,0,"E",null,null,null,null,null,null,null,null,null,0,null,0,"E","---","ERR","","----"]
[null,47,null,null,null,null,null,null,null,null,null,null,null,null,null,null,null,null,null,null,null,null,null,null,null,null,null,null,null,null,null,null,0,0,0,0,0,0,0,0,0,0,0,0,0,null,null,null,null,null,null,null,null,null,null,null,0,0,"E",null,null,null,null,null,null,null,null,null,null,0,0,"E",null,null,null,null,null,null,null,null,null,0,0,"E",null,null,null,null,null,null,null,null,null,null,null,0,0,"E",null,null,null,null,null,null,null,null,null,null,null,0,0,"E",null,null,null,null,null,null,null,null,null,null,0,0,"E",null,null,null,null,null,null,null,null,0,null,0,"E",null,null,null,null,null,null,null,null,null,0,null,0,"E",null,null,null,null,null,null,null,null,null,0,null,0,"E","---","ERR","","----"]
[null,48,null,null,null,null,null,null,null,null,null,null,null,null,null,null,null,null,null,null,null,null,null,null,null,null,null,null,null,null,null,null,0,0,0,0,0,0,0,0,0,0,0,0,0,null,null,null,null,null,null,null,null,null,null,null,0,0,"E",null,null,null,null,null,null,null,null,null,null,0,0,"E",null,null,null,null,null,null,null,null,null,0,0,"E",null,null,null,null,null,null,null,null,null,null,null,0,0,"E",null,null,null,null,null,null,null,null,null,null,null,0,0,"E",null,null,null,null,null,null,null,null,null,null,0,0,"E",null,null,null,null,null,null,null,null,0,null,0,"E",null,null,null,null,null,null,null,null,null,0,null,0,"E",null,null,null,null,null,null,null,null,null,0,null,0,"E","---","ERR","","----"]
[null,49,null,null,null,null,null,null,null,null,null,null,null,null,null,null,null,null,null,null,null,null,null,null,null,null,null,null,null,null,null,null,0,0,0,0,0,0,0,0,0,0,0,0,0,null,null,null,null,null,null,null,null,null,null,null,0,0,"E",null,null,null,null,null,null,null,null,null,null,0,0,"E",null,null,null,null,null,null,null,null,null,0,0,"E",null,null,null,null,null,null,null,null,null,null,null,0,0,"E",null,null,null,null,null,null,null,null,null,null,null,0,0,"E",null,null,null,null,null,null,null,null,null,null,0,0,"E",null,null,null,null,null,null,null,null,0,null,0,"E",null,null,null,null,null,null,null,null,null,0,null,0,"E",null,null,null,null,null,null,null,null,null,0,null,0,"E","---","ERR","","----"]
[null,50,null,null,null,null,null,null,null,null,null,null,null,null,null,null,null,null,null,null,null,null,null,null,null,null,null,null,null,null,null,null,0,0,0,0,0,0,0,0,0,0,0,0,0,null,null,null,null,null,null,null,null,null,null,null,0,0,"E",null,null,null,null,null,null,null,null,null,null,0,0,"E",null,null,null,null,null,null,null,null,null,0,0,"E",null,null,null,null,null,null,null,null,null,null,null,0,0,"E",null,null,null,null,null,null,null,null,null,null,null,0,0,"E",null,null,null,null,null,null,null,null,null,null,0,0,"E",null,null,null,null,null,null,null,null,0,null,0,"E",null,null,null,null,null,null,null,null,null,0,null,0,"E",null,null,null,null,null,null,null,null,null,0,null,0,"E","---","ERR","","----"]
[null,51,null,null,null,null,null,null,null,null,null,null,null,null,null,null,null,null,null,null,null,null,null,null,null,null,null,null,null,null,null,null,0,0,0,0,0,0,0,0,0,0,0,0,0,null,null,null,null,null,null,null,null,null,null,null,0,0,"E",null,null,null,null,null,null,null,null,null,null,0,0,"E",null,null,null,null,null,null,null,null,null,0,0,"E",null,null,null,null,null,null,null,null,null,null,null,0,0,"E",null,null,null,null,null,null,null,null,null,null,null,0,0,"E",null,null,null,null,null,null,null,null,null,null,0,0,"E",null,null,null,null,null,null,null,null,0,null,0,"E",null,null,null,null,null,null,null,null,null,0,null,0,"E",null,null,null,null,null,null,null,null,null,0,null,0,"E","---","ERR","","----"]
[null,52,null,null,null,null,null,null,null,null,null,null,null,null,null,null,null,null,null,null,null,null,null,null,null,null,null,null,null,null,null,null,0,0,0,0,0,0,0,0,0,0,0,0,0,null,null,null,null,null,null,null,null,null,null,null,0,0,"E",null,null,null,null,null,null,null,null,null,null,0,0,"E",null,null,null,null,null,null,null,null,null,0,0,"E",null,null,null,null,null,null,null,null,null,null,null,0,0,"E",null,null,null,null,null,null,null,null,null,null,null,0,0,"E",null,null,null,null,null,null,null,null,null,null,0,0,"E",null,null,null,null,null,null,null,null,0,null,0,"E",null,null,null,null,null,null,null,null,null,0,null,0,"E",null,null,null,null,null,null,null,null,null,0,null,0,"E","---","ERR","","----"]
[null,53,null,null,null,null,null,null,null,null,null,null,null,null,null,null,null,null,null,null,null,null,null,null,null,null,null,null,null,null,null,null,0,0,0,0,0,0,0,0,0,0,0,0,0,null,null,null,null,null,null,null,null,null,null,null,0,0,"E",null,null,null,null,null,null,null,null,null,null,0,0,"E",null,null,null,null,null,null,null,null,null,0,0,"E",null,null,null,null,null,null,null,null,null,null,null,0,0,"E",null,null,null,null,null,null,null,null,null,null,null,0,0,"E",null,null,null,null,null,null,null,null,null,null,0,0,"E",null,null,null,null,null,null,null,null,0,null,0,"E",null,null,null,null,null,null,null,null,null,0,null,0,"E",null,null,null,null,null,null,null,null,null,0,null,0,"E","---","ERR","","----"]
[null,54,null,null,null,null,null,null,null,null,null,null,null,null,null,null,null,null,null,null,null,null,null,null,null,null,null,null,null,null,null,null,0,0,0,0,0,0,0,0,0,0,0,0,0,null,null,null,null,null,null,null,null,null,null,null,0,0,"E",null,null,null,null,null,null,null,null,null,null,0,0,"E",null,null,null,null,null,null,null,null,null,0,0,"E",null,null,null,null,null,null,null,null,null,null,null,0,0,"E",null,null,null,null,null,null,null,null,null,null,null,0,0,"E",null,null,null,null,null,null,null,null,null,null,0,0,"E",null,null,null,null,null,null,null,null,0,null,0,"E",null,null,null,null,null,null,null,null,null,0,null,0,"E",null,null,null,null,null,null,null,null,null,0,null,0,"E","---","ERR","","----"]
[null,55,null,null,null,null,null,null,null,null,null,null,null,null,null,null,null,null,null,null,null,null,null,null,null,null,null,null,null,null,null,null,0,0,0,0,0,0,0,0,0,0,0,0,0,null,null,null,null,null,null,null,null,null,null,null,0,0,"E",null,null,null,null,null,null,null,null,null,null,0,0,"E",null,null,null,null,null,null,null,null,null,0,0,"E",null,null,null,null,null,null,null,null,null,null,null,0,0,"E",null,null,null,null,null,null,null,null,null,null,null,0,0,"E",null,null,null,null,null,null,null,null,null,null,0,0,"E",null,null,null,null,null,null,null,null,0,null,0,"E",null,null,null,null,null,null,null,null,null,0,null,0,"E",null,null,null,null,null,null,null,null,null,0,null,0,"E","---","ERR","","----"]
[null,56,null,null,null,null,null,null,null,null,null,null,null,null,null,null,null,null,null,null,null,null,null,null,null,null,null,null,null,null,null,null,0,0,0,0,0,0,0,0,0,0,0,0,0,null,null,null,null,null,null,null,null,null,null,null,0,0,"E",null,null,null,null,null,null,null,null,null,null,0,0,"E",null,null,null,null,null,null,null,null,null,0,0,"E",null,null,null,null,null,null,null,null,null,null,null,0,0,"E",null,null,null,null,null,null,null,null,null,null,null,0,0,"E",null,null,null,null,null,null,null,null,null,null,0,0,"E",null,null,null,null,null,null,null,null,0,null,0,"E",null,null,null,null,null,null,null,null,null,0,null,0,"E",null,null,null,null,null,null,null,null,null,0,null,0,"E","---","ERR","","----"]
[null,57,null,null,null,null,null,null,null,null,null,null,null,null,null,null,null,null,null,null,null,null,null,null,null,null,null,null,null,null,null,null,0,0,0,0,0,0,0,0,0,0,0,0,0,null,null,null,null,null,null,null,null,null,null,null,0,0,"E",null,null,null,null,null,null,null,null,null,null,0,0,"E",null,null,null,null,null,null,null,null,null,0,0,"E",null,null,null,null,null,null,null,null,null,null,null,0,0,"E",null,null,null,null,null,null,null,null,null,null,null,0,0,"E",null,null,null,null,null,null,null,null,null,null,0,0,"E",null,null,null,null,null,null,null,null,0,null,0,"E",null,null,null,null,null,null,null,null,null,0,null,0,"E",null,null,null,null,null,null,null,null,null,0,null,0,"E","---","ERR","","----"]
[null,58,null,null,null,null,null,null,null,null,null,null,null,null,null,null,null,null,null,null,null,null,null,null,null,null,null,null,null,null,null,null,0,0,0,0,0,0,0,0,0,0,0,0,0,null,null,null,null,null,null,null,null,null,null,null,0,0,"E",null,null,null,null,null,null,null,null,null,null,0,0,"E",null,null,null,null,null,null,null,null,null,0,0,"E",null,null,null,null,null,null,null,null,null,null,null,0,0,"E",null,null,null,null,null,null,null,null,null,null,null,0,0,"E",null,null,null,null,null,null,null,null,null,null,0,0,"E",null,null,null,null,null,null,null,null,0,null,0,"E",null,null,null,null,null,null,null,null,null,0,null,0,"E",null,null,null,null,null,null,null,null,null,0,null,0,"E","---","ERR","","----"]
[null,59,null,null,null,null,null,null,null,null,null,null,null,null,null,null,null,null,null,null,null,null,null,null,null,null,null,null,null,null,null,null,0,0,0,0,0,0,0,0,0,0,0,0,0,null,null,null,null,null,null,null,null,null,null,null,0,0,"E",null,null,null,null,null,null,null,null,null,null,0,0,"E",null,null,null,null,null,null,null,null,null,0,0,"E",null,null,null,null,null,null,null,null,null,null,null,0,0,"E",null,null,null,null,null,null,null,null,null,null,null,0,0,"E",null,null,null,null,null,null,null,null,null,null,0,0,"E",null,null,null,null,null,null,null,null,0,null,0,"E",null,null,null,null,null,null,null,null,null,0,null,0,"E",null,null,null,null,null,null,null,null,null,0,null,0,"E","---","ERR","","----"]
[null,60,null,null,null,null,null,null,null,null,null,null,null,null,null,null,null,null,null,null,null,null,null,null,null,null,null,null,null,null,null,null,0,0,0,0,0,0,0,0,0,0,0,0,0,null,null,null,null,null,null,null,null,null,null,null,0,0,"E",null,null,null,null,null,null,null,null,null,null,0,0,"E",null,null,null,null,null,null,null,null,null,0,0,"E",null,null,null,null,null,null,null,null,null,null,null,0,0,"E",null,null,null,null,null,null,null,null,null,null,null,0,0,"E",null,null,null,null,null,null,null,null,null,null,0,0,"E",null,null,null,null,null,null,null,null,0,null,0,"E",null,null,null,null,null,null,null,null,null,0,null,0,"E",null,null,null,null,null,null,null,null,null,0,null,0,"E","---","ERR","","----"]
[null,61,null,null,null,null,null,null,null,null,null,null,null,null,null,null,null,null,null,null,null,null,null,null,null,null,null,null,null,null,null,null,0,0,0,0,0,0,0,0,0,0,0,0,0,null,null,null,null,null,null,null,null,null,null,null,0,0,"E",null,null,null,null,null,null,null,null,null,null,0,0,"E",null,null,null,null,null,null,null,null,null,0,0,"E",null,null,null,null,null,null,null,null,null,null,null,0,0,"E",null,null,null,null,null,null,null,null,null,null,null,0,0,"E",null,null,null,null,null,null,null,null,null,null,0,0,"E",null,null,null,null,null,null,null,null,0,null,0,"E",null,null,null,null,null,null,null,null,null,0,null,0,"E",null,null,null,null,null,null,null,null,null,0,null,0,"E","---","ERR","","----"]
[null,62,null,null,null,null,null,null,null,null,null,null,null,null,null,null,null,null,null,null,null,null,null,null,null,null,null,null,null,null,null,null,0,0,0,0,0,0,0,0,0,0,0,0,0,null,null,null,null,null,null,null,null,null,null,null,0,0,"E",null,null,null,null,null,null,null,null,null,null,0,0,"E",null,null,null,null,null,null,null,null,null,0,0,"E",null,null,null,null,null,null,null,null,null,null,null,0,0,"E",null,null,null,null,null,null,null,null,null,null,null,0,0,"E",null,null,null,null,null,null,null,null,null,null,0,0,"E",null,null,null,null,null,null,null,null,0,null,0,"E",null,null,null,null,null,null,null,null,null,0,null,0,"E",null,null,null,null,null,null,null,null,null,0,null,0,"E","---","ERR","","----"]
[null,63,null,null,null,null,null,null,null,null,null,null,null,null,null,null,null,null,null,null,null,null,null,null,null,null,null,null,null,null,null,null,0,0,0,0,0,0,0,0,0,0,0,0,0,null,null,null,null,null,null,null,null,null,null,null,0,0,"E",null,null,null,null,null,null,null,null,null,null,0,0,"E",null,null,null,null,null,null,null,null,null,0,0,"E",null,null,null,null,null,null,null,null,null,null,null,0,0,"E",null,null,null,null,null,null,null,null,null,null,null,0,0,"E",null,null,null,null,null,null,null,null,null,null,0,0,"E",null,null,null,null,null,null,null,null,0,null,0,"E",null,null,null,null,null,null,null,null,null,0,null,0,"E",null,null,null,null,null,null,null,null,null,0,null,0,"E","---","ERR","","----"]
[null,64,null,null,null,null,null,null,null,null,null,null,null,null,null,null,null,null,null,null,null,null,null,null,null,null,null,null,null,null,null,null,0,0,0,0,0,0,0,0,0,0,0,0,0,null,null,null,null,null,null,null,null,null,null,null,0,0,"E",null,null,null,null,null,null,null,null,null,null,0,0,"E",null,null,null,null,null,null,null,null,null,0,0,"E",null,null,null,null,null,null,null,null,null,null,null,0,0,"E",null,null,null,null,null,null,null,null,null,null,null,0,0,"E",null,null,null,null,null,null,null,null,null,null,0,0,"E",null,null,null,null,null,null,null,null,0,null,0,"E",null,null,null,null,null,null,null,null,null,0,null,0,"E",null,null,null,null,null,null,null,null,null,0,null,0,"E","---","ERR","","----"]
[null,65,null,null,null,null,null,null,null,null,null,null,null,null,null,null,null,null,null,null,null,null,null,null,null,null,null,null,null,null,null,null,0,0,0,0,0,0,0,0,0,0,0,0,0,null,null,null,null,null,null,null,null,null,null,null,0,0,"E",null,null,null,null,null,null,null,null,null,null,0,0,"E",null,null,null,null,null,null,null,null,null,0,0,"E",null,null,null,null,null,null,null,null,null,null,null,0,0,"E",null,null,null,null,null,null,null,null,null,null,null,0,0,"E",null,null,null,null,null,null,null,null,null,null,0,0,"E",null,null,null,null,null,null,null,null,0,null,0,"E",null,null,null,null,null,null,null,null,null,0,null,0,"E",null,null,null,null,null,null,null,null,null,0,null,0,"E","---","ERR","","----"]
[null,66,null,null,null,null,null,null,null,null,null,null,null,null,null,null,null,null,null,null,null,null,null,null,null,null,null,null,null,null,null,null,{"$f":"SUM(V72:AF72)","v":0},{"$f":"V72/$V$4","v":0},{"$f":"W72/$W$4","v":0},{"$f":"X72/$X$4","v":0},{"$f":"Y72/$Y$4","v":0},{"$f":"Z72/$Z$4","v":0},{"$f":"AA72/$AA$4","v":0},{"$f":"AB72/$AB$4","v":0},{"$f":"AC72/$AC$4","v":0},{"$f":"AD72/$AD$4","v":0},{"$f":"AE72/$AE$4","v":0},{"$f":"AF72/$AF$4","v":0},{"$f":"AG72/$AG$4","v":0},null,null,null,null,null,null,null,null,null,null,null,{"$f":"SUM(AZ72:BD72)","v":0},{"$f":"BE72+AY72","v":0},{"$f":"IFERROR(IF(BF72>90,\"A+\",IF(BF72>80,\"A\",IF(BF72>70,\"B+\",IF(BF72>60,\"B\",IF(BF72>50,\"C+\",IF(BF72>40,\"C\",IF(BF72>=33,\"D\",\"E\"))))))),\"Abs\")","v":"E"},null,null,null,null,null,null,null,null,null,null,{"$f":"SUM(BM72:BQ72)","v":0},{"$f":"BR72+BL72","v":0},{"$f":"IFERROR(IF(BS72>90,\"A+\",IF(BS72>80,\"A\",IF(BS72>70,\"B+\",IF(BS72>60,\"B\",IF(BS72>50,\"C+\",IF(BS72>40,\"C\",IF(BS72>=33,\"D\",\"E\"))))))),\"Abs\")","v":"E"},null,null,null,null,null,null,null,null,null,{"$f":"SUM(BZ72:CC72)","v":0},{"$f":"CD72+BY72","v":0},{"$f":"IFERROR(IF(CE72>90,\"A+\",IF(CE72>80,\"A\",IF(CE72>70,\"B+\",IF(CE72>60,\"B\",IF(CE72>50,\"C+\",IF(CE72>40,\"C\",IF(CE72>=33,\"D\",\"E\"))))))),\"Abs\")","v":"E"},null,null,null,null,null,null,null,null,null,null,null,{"$f":"SUM(CL72:CQ72)","v":0},{"$f":"CR72+CK72","v":0},{"$f":"IFERROR(IF(CS72>90,\"A+\",IF(CS72>80,\"A\",IF(CS72>70,\"B+\",IF(CS72>60,\"B\",IF(CS72>50,\"C+\",IF(CS72>40,\"C\",IF(CS72>=33,\"D\",\"E\"))))))),\"Abs\")","v":"E"},null,null,null,null,null,null,null,null,null,null,null,{"$f":"SUM(CZ72:DE72)","v":0},{"$f":"DF72+CY72","v":0},{"$f":"IFERROR(IF(DG72>90,\"A+\",IF(DG72>80,\"A\",IF(DG72>70,\"B+\",IF(DG72>60,\"B\",IF(DG72>50,\"C+\",IF(DG72>40,\"C\",IF(DG72>=33,\"D\",\"E\"))))))),\"Abs\")","v":"E"},null,null,null,null,null,null,null,null,null,null,{"$f":"SUM(DN72:DR72)","v":0},{"$f":"DS72+DM72","v":0},{"$f":"IFERROR(IF(DT72>90,\"A+\",IF(DT72>80,\"A\",IF(DT72>70,\"B+\",IF(DT72>60,\"B\",IF(DT72>50,\"C+\",IF(DT72>40,\"C\",IF(DT72>=33,\"D\",\"E\"))))))),\"Abs\")","v":"E"},null,null,null,null,null,null,null,null,{"$f":"SUM(EA72:EC72)","v":0},null,{"$f":"EE72+ED72+DZ72","v":0},{"$f":"IFERROR(IF(EF72>90,\"A+\",IF(EF72>80,\"A\",IF(EF72>70,\"B+\",IF(EF72>60,\"B\",IF(EF72>50,\"C+\",IF(EF72>40,\"C\",IF(EF72>=33,\"D\",\"E\"))))))),\"Abs\")","v":"E"},null,null,null,null,null,null,null,null,null,{"$f":"SUM(EM72:EP72)","v":0},null,{"$f":"ER72+EQ72+EL72","v":0},{"$f":"IFERROR(IF(ES72>90,\"A+\",IF(ES72>80,\"A\",IF(ES72>70,\"B+\",IF(ES72>60,\"B\",IF(ES72>50,\"C+\",IF(ES72>40,\"C\",IF(ES72>=33,\"D\",\"E\"))))))),\"Abs\")","v":"E"},null,null,null,null,null,null,null,null,null,{"$f":"SUM(EZ72:FC72)","v":0},null,{"$f":"FE72+FD72+EY72","v":0},{"$f":"IFERROR(IF(FF72>90,\"A+\",IF(FF72>80,\"A\",IF(FF72>70,\"B+\",IF(FF72>60,\"B\",IF(FF72>50,\"C+\",IF(FF72>40,\"C\",IF(FF72>=33,\"D\",\"E\"))))))),\"Abs\")","v":"E"},{"$f":"IF(AND(MIN(AY72,BL72,BY72,CK72,CY72,DM72)>19,MIN(BF72,BS72,CE72,CS72,DG72,DT72)>32),SUM(BF72,BS72,CE72,CS72,DG72,DT72),\"---\")","v":"---"},{"$f":"IFERROR(FH72/600*100,\"ERR\")","v":"ERR"},{"$f":"IF(FI72=\"ERR\",\"\",(IF(FI72>90,\"A+\",IF(FI72>80,\"A\",IF(FI72>70,\"B+\",IF(FI72>60,\"B\",IF(FI72>50,\"C+\",IF(FI72>40,\"C\",IF(FI72>=33,\"D\",IF(FI72<33,\"E\",\"\"))))))))))","v":""},{"$f":"IF(FI72=\"ERR\",\"----\",IF(FI72>=33,\"ਪਾਸ\",\"--\"))","v":"----"}]
[null,67,null,null,null,null,null,null,null,null,null,null,null,null,null,null,null,null,null,null,null,null,null,null,null,null,null,null,null,null,null,null,0,0,0,0,0,0,0,0,0,0,0,0,0,null,null,null,null,null,null,null,null,null,null,null,0,0,"E",null,null,null,null,null,null,null,null,null,null,0,0,"E",null,null,null,null,null,null,null,null,null,0,0,"E",null,null,null,null,null,null,null,null,null,null,null,0,0,"E",null,null,null,null,null,null,null,null,null,null,null,0,0,"E",null,null,null,null,null,null,null,null,null,null,0,0,"E",null,null,null,null,null,null,null,null,0,null,0,"E",null,null,null,null,null,null,null,null,null,0,null,0,"E",null,null,null,null,null,null,null,null,null,0,null,0,"E","---","ERR","","----"]
[null,68,null,null,null,null,null,null,null,null,null,null,null,null,null,null,null,null,null,null,null,null,null,null,null,null,null,null,null,null,null,null,0,0,0,0,0,0,0,0,0,0,0,0,0,null,null,null,null,null,null,null,null,null,null,null,0,0,"E",null,null,null,null,null,null,null,null,null,null,0,0,"E",null,null,null,null,null,null,null,null,null,0,0,"E",null,null,null,null,null,null,null,null,null,null,null,0,0,"E",null,null,null,null,null,null,null,null,null,null,null,0,0,"E",null,null,null,null,null,null,null,null,null,null,0,0,"E",null,null,null,null,null,null,null,null,0,null,0,"E",null,null,null,null,null,null,null,null,null,0,null,0,"E",null,null,null,null,null,null,null,null,null,0,null,0,"E","---","ERR","","----"]
[null,69,null,null,null,null,null,null,null,null,null,null,null,null,null,null,null,null,null,null,null,null,null,null,null,null,null,null,null,null,null,null,0,0,0,0,0,0,0,0,0,0,0,0,0,null,null,null,null,null,null,null,null,null,null,null,0,0,"E",null,null,null,null,null,null,null,null,null,null,0,0,"E",null,null,null,null,null,null,null,null,null,0,0,"E",null,null,null,null,null,null,null,null,null,null,null,0,0,"E",null,null,null,null,null,null,null,null,null,null,null,0,0,"E",null,null,null,null,null,null,null,null,null,null,0,0,"E",null,null,null,null,null,null,null,null,0,null,0,"E",null,null,null,null,null,null,null,null,null,0,null,0,"E",null,null,null,null,null,null,null,null,null,0,null,0,"E","---","ERR","","----"]
[null,70,null,null,null,null,null,null,null,null,null,null,null,null,null,null,null,null,null,null,null,null,null,null,null,null,null,null,null,null,null,null,0,0,0,0,0,0,0,0,0,0,0,0,0,null,null,null,null,null,null,null,null,null,null,null,0,0,"E",null,null,null,null,null,null,null,null,null,null,0,0,"E",null,null,null,null,null,null,null,null,null,0,0,"E",null,null,null,null,null,null,null,null,null,null,null,0,0,"E",null,null,null,null,null,null,null,null,null,null,null,0,0,"E",null,null,null,null,null,null,null,null,null,null,0,0,"E",null,null,null,null,null,null,null,null,0,null,0,"E",null,null,null,null,null,null,null,null,null,0,null,0,"E",null,null,null,null,null,null,null,null,null,0,null,0,"E","---","ERR","","----"]
[null,71,null,null,null,null,null,null,null,null,null,null,null,null,null,null,null,null,null,null,null,null,null,null,null,null,null,null,null,null,null,null,0,0,0,0,0,0,0,0,0,0,0,0,0,null,null,null,null,null,null,null,null,null,null,null,0,0,"E",null,null,null,null,null,null,null,null,null,null,0,0,"E",null,null,null,null,null,null,null,null,null,0,0,"E",null,null,null,null,null,null,null,null,null,null,null,0,0,"E",null,null,null,null,null,null,null,null,null,null,null,0,0,"E",null,null,null,null,null,null,null,null,null,null,0,0,"E",null,null,null,null,null,null,null,null,0,null,0,"E",null,null,null,null,null,null,null,null,null,0,null,0,"E",null,null,null,null,null,null,null,null,null,0,null,0,"E","---","ERR","","----"]
[null,72,null,null,null,null,null,null,null,null,null,null,null,null,null,null,null,null,null,null,null,null,null,null,null,null,null,null,null,null,null,null,0,0,0,0,0,0,0,0,0,0,0,0,0,null,null,null,null,null,null,null,null,null,null,null,0,0,"E",null,null,null,null,null,null,null,null,null,null,0,0,"E",null,null,null,null,null,null,null,null,null,0,0,"E",null,null,null,null,null,null,null,null,null,null,null,0,0,"E",null,null,null,null,null,null,null,null,null,null,null,0,0,"E",null,null,null,null,null,null,null,null,null,null,0,0,"E",null,null,null,null,null,null,null,null,0,null,0,"E",null,null,null,null,null,null,null,null,null,0,null,0,"E",null,null,null,null,null,null,null,null,null,0,null,0,"E","---","ERR","","----"]
[null,73,null,null,null,null,null,null,null,null,null,null,null,null,null,null,null,null,null,null,null,null,null,null,null,null,null,null,null,null,null,null,0,0,0,0,0,0,0,0,0,0,0,0,0,null,null,null,null,null,null,null,null,null,null,null,0,0,"E",null,null,null,null,null,null,null,null,null,null,0,0,"E",null,null,null,null,null,null,null,null,null,0,0,"E",null,null,null,null,null,null,null,null,null,null,null,0,0,"E",null,null,null,null,null,null,null,null,null,null,null,0,0,"E",null,null,null,null,null,null,null,null,null,null,0,0,"E",null,null,null,null,null,null,null,null,0,null,0,"E",null,null,null,null,null,null,null,null,null,0,null,0,"E",null,null,null,null,null,null,null,null,null,0,null,0,"E","---","ERR","","----"]
[null,74,null,null,null,null,null,null,null,null,null,null,null,null,null,null,null,null,null,null,null,null,null,null,null,null,null,null,null,null,null,null,0,0,0,0,0,0,0,0,0,0,0,0,0,null,null,null,null,null,null,null,null,null,null,null,0,0,"E",null,null,null,null,null,null,null,null,null,null,0,0,"E",null,null,null,null,null,null,null,null,null,0,0,"E",null,null,null,null,null,null,null,null,null,null,null,0,0,"E",null,null,null,null,null,null,null,null,null,null,null,0,0,"E",null,null,null,null,null,null,null,null,null,null,0,0,"E",null,null,null,null,null,null,null,null,0,null,0,"E",null,null,null,null,null,null,null,null,null,0,null,0,"E",null,null,null,null,null,null,null,null,null,0,null,0,"E","---","ERR","","----"]
[null,75,null,null,null,null,null,null,null,null,null,null,null,null,null,null,null,null,null,null,null,null,null,null,null,null,null,null,null,null,null,null,0,0,0,0,0,0,0,0,0,0,0,0,0,null,null,null,null,null,null,null,null,null,null,null,0,0,"E",null,null,null,null,null,null,null,null,null,null,0,0,"E",null,null,null,null,null,null,null,null,null,0,0,"E",null,null,null,null,null,null,null,null,null,null,null,0,0,"E",null,null,null,null,null,null,null,null,null,null,null,0,0,"E",null,null,null,null,null,null,null,null,null,null,0,0,"E",null,null,null,null,null,null,null,null,0,null,0,"E",null,null,null,null,null,null,null,null,null,0,null,0,"E",null,null,null,null,null,null,null,null,null,0,null,0,"E","---","ERR","","----"]
[null,76,null,null,null,null,null,null,null,null,null,null,null,null,null,null,null,null,null,null,null,null,null,null,null,null,null,null,null,null,null,null,0,0,0,0,0,0,0,0,0,0,0,0,0,null,null,null,null,null,null,null,null,null,null,null,0,0,"E",null,null,null,null,null,null,null,null,null,null,0,0,"E",null,null,null,null,null,null,null,null,null,0,0,"E",null,null,null,null,null,null,null,null,null,null,null,0,0,"E",null,null,null,null,null,null,null,null,null,null,null,0,0,"E",null,null,null,null,null,null,null,null,null,null,0,0,"E",null,null,null,null,null,null,null,null,0,null,0,"E",null,null,null,null,null,null,null,null,null,0,null,0,"E",null,null,null,null,null,null,null,null,null,0,null,0,"E","---","ERR","","----"]
[null,77,null,null,null,null,null,null,null,null,null,null,null,null,null,null,null,null,null,null,null,null,null,null,null,null,null,null,null,null,null,null,0,0,0,0,0,0,0,0,0,0,0,0,0,null,null,null,null,null,null,null,null,null,null,null,0,0,"E",null,null,null,null,null,null,null,null,null,null,0,0,"E",null,null,null,null,null,null,null,null,null,0,0,"E",null,null,null,null,null,null,null,null,null,null,null,0,0,"E",null,null,null,null,null,null,null,null,null,null,null,0,0,"E",null,null,null,null,null,null,null,null,null,null,0,0,"E",null,null,null,null,null,null,null,null,0,null,0,"E",null,null,null,null,null,null,null,null,null,0,null,0,"E",null,null,null,null,null,null,null,null,null,0,null,0,"E","---","ERR","","----"]
[null,78,null,null,null,null,null,null,null,null,null,null,null,null,null,null,null,null,null,null,null,null,null,null,null,null,null,null,null,null,null,null,0,0,0,0,0,0,0,0,0,0,0,0,0,null,null,null,null,null,null,null,null,null,null,null,0,0,"E",null,null,null,null,null,null,null,null,null,null,0,0,"E",null,null,null,null,null,null,null,null,null,0,0,"E",null,null,null,null,null,null,null,null,null,null,null,0,0,"E",null,null,null,null,null,null,null,null,null,null,null,0,0,"E",null,null,null,null,null,null,null,null,null,null,0,0,"E",null,null,null,null,null,null,null,null,0,null,0,"E",null,null,null,null,null,null,null,null,null,0,null,0,"E",null,null,null,null,null,null,null,null,null,0,null,0,"E","---","ERR","","----"]
[null,79,null,null,null,null,null,null,null,null,null,null,null,null,null,null,null,null,null,null,null,null,null,null,null,null,null,null,null,null,null,null,0,0,0,0,0,0,0,0,0,0,0,0,0,null,null,null,null,null,null,null,null,null,null,null,0,0,"E",null,null,null,null,null,null,null,null,null,null,0,0,"E",null,null,null,null,null,null,null,null,null,0,0,"E",null,null,null,null,null,null,null,null,null,null,null,0,0,"E",null,null,null,null,null,null,null,null,null,null,null,0,0,"E",null,null,null,null,null,null,null,null,null,null,0,0,"E",null,null,null,null,null,null,null,null,0,null,0,"E",null,null,null,null,null,null,null,null,null,0,null,0,"E",null,null,null,null,null,null,null,null,null,0,null,0,"E","---","ERR","","----"]
[null,80,null,null,null,null,null,null,null,null,null,null,null,null,null,null,null,null,null,null,null,null,null,null,null,null,null,null,null,null,null,null,0,0,0,0,0,0,0,0,0,0,0,0,0,null,null,null,null,null,null,null,null,null,null,null,0,0,"E",null,null,null,null,null,null,null,null,null,null,0,0,"E",null,null,null,null,null,null,null,null,null,0,0,"E",null,null,null,null,null,null,null,null,null,null,null,0,0,"E",null,null,null,null,null,null,null,null,null,null,null,0,0,"E",null,null,null,null,null,null,null,null,null,null,0,0,"E",null,null,null,null,null,null,null,null,0,null,0,"E",null,null,null,null,null,null,null,null,null,0,null,0,"E",null,null,null,null,null,null,null,null,null,0,null,0,"E","---","ERR","","----"]
[null,81,null,null,null,null,null,null,null,null,null,null,null,null,null,null,null,null,null,null,null,null,null,null,null,null,null,null,null,null,null,null,0,0,0,0,0,0,0,0,0,0,0,0,0,null,null,null,null,null,null,null,null,null,null,null,0,0,"E",null,null,null,null,null,null,null,null,null,null,0,0,"E",null,null,null,null,null,null,null,null,null,0,0,"E",null,null,null,null,null,null,null,null,null,null,null,0,0,"E",null,null,null,null,null,null,null,null,null,null,null,0,0,"E",null,null,null,null,null,null,null,null,null,null,0,0,"E",null,null,null,null,null,null,null,null,0,null,0,"E",null,null,null,null,null,null,null,null,null,0,null,0,"E",null,null,null,null,null,null,null,null,null,0,null,0,"E","---","ERR","","----"]
[null,82,null,null,null,null,null,null,null,null,null,null,null,null,null,null,null,null,null,null,null,null,null,null,null,null,null,null,null,null,null,null,0,0,0,0,0,0,0,0,0,0,0,0,0,null,null,null,null,null,null,null,null,null,null,null,0,0,"E",null,null,null,null,null,null,null,null,null,null,0,0,"E",null,null,null,null,null,null,null,null,null,0,0,"E",null,null,null,null,null,null,null,null,null,null,null,0,0,"E",null,null,null,null,null,null,null,null,null,null,null,0,0,"E",null,null,null,null,null,null,null,null,null,null,0,0,"E",null,null,null,null,null,null,null,null,0,null,0,"E",null,null,null,null,null,null,null,null,null,0,null,0,"E",null,null,null,null,null,null,null,null,null,0,null,0,"E","---","ERR","","----"]
[null,83,null,null,null,null,null,null,null,null,null,null,null,null,null,null,null,null,null,null,null,null,null,null,null,null,null,null,null,null,null,null,0,0,0,0,0,0,0,0,0,0,0,0,0,null,null,null,null,null,null,null,null,null,null,null,0,0,"E",null,null,null,null,null,null,null,null,null,null,0,0,"E",null,null,null,null,null,null,null,null,null,0,0,"E",null,null,null,null,null,null,null,null,null,null,null,0,0,"E",null,null,null,null,null,null,null,null,null,null,null,0,0,"E",null,null,null,null,null,null,null,null,null,null,0,0,"E",null,null,null,null,null,null,null,null,0,null,0,"E",null,null,null,null,null,null,null,null,null,0,null,0,"E",null,null,null,null,null,null,null,null,null,0,null,0,"E","---","ERR","","----"]
[null,84,null,null,null,null,null,null,null,null,null,null,null,null,null,null,null,null,null,null,null,null,null,null,null,null,null,null,null,null,null,null,0,0,0,0,0,0,0,0,0,0,0,0,0,null,null,null,null,null,null,null,null,null,null,null,0,0,"E",null,null,null,null,null,null,null,null,null,null,0,0,"E",null,null,null,null,null,null,null,null,null,0,0,"E",null,null,null,null,null,null,null,null,null,null,null,0,0,"E",null,null,null,null,null,null,null,null,null,null,null,0,0,"E",null,null,null,null,null,null,null,null,null,null,0,0,"E",null,null,null,null,null,null,null,null,0,null,0,"E",null,null,null,null,null,null,null,null,null,0,null,0,"E",null,null,null,null,null,null,null,null,null,0,null,0,"E","---","ERR","","----"]
[null,85,null,null,null,null,null,null,null,null,null,null,null,null,null,null,null,null,null,null,null,null,null,null,null,null,null,null,null,null,null,null,0,0,0,0,0,0,0,0,0,0,0,0,0,null,null,null,null,null,null,null,null,null,null,null,0,0,"E",null,null,null,null,null,null,null,null,null,null,0,0,"E",null,null,null,null,null,null,null,null,null,0,0,"E",null,null,null,null,null,null,null,null,null,null,null,0,0,"E",null,null,null,null,null,null,null,null,null,null,null,0,0,"E",null,null,null,null,null,null,null,null,null,null,0,0,"E",null,null,null,null,null,null,null,null,0,null,0,"E",null,null,null,null,null,null,null,null,null,0,null,0,"E",null,null,null,null,null,null,null,null,null,0,null,0,"E","---","ERR","","----"]
[null,86,null,null,null,null,null,null,null,null,null,null,null,null,null,null,null,null,null,null,null,null,null,null,null,null,null,null,null,null,null,null,0,0,0,0,0,0,0,0,0,0,0,0,0,null,null,null,null,null,null,null,null,null,null,null,0,0,"E",null,null,null,null,null,null,null,null,null,null,0,0,"E",null,null,null,null,null,null,null,null,null,0,0,"E",null,null,null,null,null,null,null,null,null,null,null,0,0,"E",null,null,null,null,null,null,null,null,null,null,null,0,0,"E",null,null,null,null,null,null,null,null,null,null,0,0,"E",null,null,null,null,null,null,null,null,0,null,0,"E",null,null,null,null,null,null,null,null,null,0,null,0,"E",null,null,null,null,null,null,null,null,null,0,null,0,"E","---","ERR","","----"]
[null,87,null,null,null,null,null,null,null,null,null,null,null,null,null,null,null,null,null,null,null,null,null,null,null,null,null,null,null,null,null,null,0,0,0,0,0,0,0,0,0,0,0,0,0,null,null,null,null,null,null,null,null,null,null,null,0,0,"E",null,null,null,null,null,null,null,null,null,null,0,0,"E",null,null,null,null,null,null,null,null,null,0,0,"E",null,null,null,null,null,null,null,null,null,null,null,0,0,"E",null,null,null,null,null,null,null,null,null,null,null,0,0,"E",null,null,null,null,null,null,null,null,null,null,0,0,"E",null,null,null,null,null,null,null,null,0,null,0,"E",null,null,null,null,null,null,null,null,null,0,null,0,"E",null,null,null,null,null,null,null,null,null,0,null,0,"E","---","ERR","","----"]
[null,88,null,null,null,null,null,null,null,null,null,null,null,null,null,null,null,null,null,null,null,null,null,null,null,null,null,null,null,null,null,null,0,0,0,0,0,0,0,0,0,0,0,0,0,null,null,null,null,null,null,null,null,null,null,null,0,0,"E",null,null,null,null,null,null,null,null,null,null,0,0,"E",null,null,null,null,null,null,null,null,null,0,0,"E",null,null,null,null,null,null,null,null,null,null,null,0,0,"E",null,null,null,null,null,null,null,null,null,null,null,0,0,"E",null,null,null,null,null,null,null,null,null,null,0,0,"E",null,null,null,null,null,null,null,null,0,null,0,"E",null,null,null,null,null,null,null,null,null,0,null,0,"E",null,null,null,null,null,null,null,null,null,0,null,0,"E","---","ERR","","----"]
[null,89,null,null,null,null,null,null,null,null,null,null,null,null,null,null,null,null,null,null,null,null,null,null,null,null,null,null,null,null,null,null,0,0,0,0,0,0,0,0,0,0,0,0,0,null,null,null,null,null,null,null,null,null,null,null,0,0,"E",null,null,null,null,null,null,null,null,null,null,0,0,"E",null,null,null,null,null,null,null,null,null,0,0,"E",null,null,null,null,null,null,null,null,null,null,null,0,0,"E",null,null,null,null,null,null,null,null,null,null,null,0,0,"E",null,null,null,null,null,null,null,null,null,null,0,0,"E",null,null,null,null,null,null,null,null,0,null,0,"E",null,null,null,null,null,null,null,null,null,0,null,0,"E",null,null,null,null,null,null,null,null,null,0,null,0,"E","---","ERR","","----"]
[null,90,null,null,null,null,null,null,null,null,null,null,null,null,null,null,null,null,null,null,null,null,null,null,null,null,null,null,null,null,null,null,0,0,0,0,0,0,0,0,0,0,0,0,0,null,null,null,null,null,null,null,null,null,null,null,0,0,"E",null,null,null,null,null,null,null,null,null,null,0,0,"E",null,null,null,null,null,null,null,null,null,0,0,"E",null,null,null,null,null,null,null,null,null,null,null,0,0,"E",null,null,null,null,null,null,null,null,null,null,null,0,0,"E",null,null,null,null,null,null,null,null,null,null,0,0,"E",null,null,null,null,null,null,null,null,0,null,0,"E",null,null,null,null,null,null,null,null,null,0,null,0,"E",null,null,null,null,null,null,null,null,null,0,null,0,"E","---","ERR","","----"]
[null,91,null,null,null,null,null,null,null,null,null,null,null,null,null,null,null,null,null,null,null,null,null,null,null,null,null,null,null,null,null,null,0,0,0,0,0,0,0,0,0,0,0,0,0,null,null,null,null,null,null,null,null,null,null,null,0,0,"E",null,null,null,null,null,null,null,null,null,null,0,0,"E",null,null,null,null,null,null,null,null,null,0,0,"E",null,null,null,null,null,null,null,null,null,null,null,0,0,"E",null,null,null,null,null,null,null,null,null,null,null,0,0,"E",null,null,null,null,null,null,null,null,null,null,0,0,"E",null,null,null,null,null,null,null,null,0,null,0,"E",null,null,null,null,null,null,null,null,null,0,null,0,"E",null,null,null,null,null,null,null,null,null,0,null,0,"E","---","ERR","","----"]
[null,92,null,null,null,null,null,null,null,null,null,null,null,null,null,null,null,null,null,null,null,null,null,null,null,null,null,null,null,null,null,null,0,0,0,0,0,0,0,0,0,0,0,0,0,null,null,null,null,null,null,null,null,null,null,null,0,0,"E",null,null,null,null,null,null,null,null,null,null,0,0,"E",null,null,null,null,null,null,null,null,null,0,0,"E",null,null,null,null,null,null,null,null,null,null,null,0,0,"E",null,null,null,null,null,null,null,null,null,null,null,0,0,"E",null,null,null,null,null,null,null,null,null,null,0,0,"E",null,null,null,null,null,null,null,null,0,null,0,"E",null,null,null,null,null,null,null,null,null,0,null,0,"E",null,null,null,null,null,null,null,null,null,0,null,0,"E","---","ERR","","----"]
[null,93,null,null,null,null,null,null,null,null,null,null,null,null,null,null,null,null,null,null,null,null,null,null,null,null,null,null,null,null,null,null,0,0,0,0,0,0,0,0,0,0,0,0,0,null,null,null,null,null,null,null,null,null,null,null,0,0,"E",null,null,null,null,null,null,null,null,null,null,0,0,"E",null,null,null,null,null,null,null,null,null,0,0,"E",null,null,null,null,null,null,null,null,null,null,null,0,0,"E",null,null,null,null,null,null,null,null,null,null,null,0,0,"E",null,null,null,null,null,null,null,null,null,null,0,0,"E",null,null,null,null,null,null,null,null,0,null,0,"E",null,null,null,null,null,null,null,null,null,0,null,0,"E",null,null,null,null,null,null,null,null,null,0,null,0,"E","---","ERR","","----"]
[null,94,null,null,null,null,null,null,null,null,null,null,null,null,null,null,null,null,null,null,null,null,null,null,null,null,null,null,null,null,null,null,0,0,0,0,0,0,0,0,0,0,0,0,0,null,null,null,null,null,null,null,null,null,null,null,0,0,"E",null,null,null,null,null,null,null,null,null,null,0,0,"E",null,null,null,null,null,null,null,null,null,0,0,"E",null,null,null,null,null,null,null,null,null,null,null,0,0,"E",null,null,null,null,null,null,null,null,null,null,null,0,0,"E",null,null,null,null,null,null,null,null,null,null,0,0,"E",null,null,null,null,null,null,null,null,0,null,0,"E",null,null,null,null,null,null,null,null,null,0,null,0,"E",null,null,null,null,null,null,null,null,null,0,null,0,"E","---","ERR","","----"]
[null,95,null,null,null,null,null,null,null,null,null,null,null,null,null,null,null,null,null,null,null,null,null,null,null,null,null,null,null,null,null,null,0,0,0,0,0,0,0,0,0,0,0,0,0,null,null,null,null,null,null,null,null,null,null,null,0,0,"E",null,null,null,null,null,null,null,null,null,null,0,0,"E",null,null,null,null,null,null,null,null,null,0,0,"E",null,null,null,null,null,null,null,null,null,null,null,0,0,"E",null,null,null,null,null,null,null,null,null,null,null,0,0,"E",null,null,null,null,null,null,null,null,null,null,0,0,"E",null,null,null,null,null,null,null,null,0,null,0,"E",null,null,null,null,null,null,null,null,null,0,null,0,"E",null,null,null,null,null,null,null,null,null,0,null,0,"E","---","ERR","","----"]
[null,96,null,null,null,null,null,null,null,null,null,null,null,null,null,null,null,null,null,null,null,null,null,null,null,null,null,null,null,null,null,null,0,0,0,0,0,0,0,0,0,0,0,0,0,null,null,null,null,null,null,null,null,null,null,null,0,0,"E",null,null,null,null,null,null,null,null,null,null,0,0,"E",null,null,null,null,null,null,null,null,null,0,0,"E",null,null,null,null,null,null,null,null,null,null,null,0,0,"E",null,null,null,null,null,null,null,null,null,null,null,0,0,"E",null,null,null,null,null,null,null,null,null,null,0,0,"E",null,null,null,null,null,null,null,null,0,null,0,"E",null,null,null,null,null,null,null,null,null,0,null,0,"E",null,null,null,null,null,null,null,null,null,0,null,0,"E","---","ERR","","----"]
[null,97,null,null,null,null,null,null,null,null,null,null,null,null,null,null,null,null,null,null,null,null,null,null,null,null,null,null,null,null,null,null,0,0,0,0,0,0,0,0,0,0,0,0,0,null,null,null,null,null,null,null,null,null,null,null,0,0,"E",null,null,null,null,null,null,null,null,null,null,0,0,"E",null,null,null,null,null,null,null,null,null,0,0,"E",null,null,null,null,null,null,null,null,null,null,null,0,0,"E",null,null,null,null,null,null,null,null,null,null,null,0,0,"E",null,null,null,null,null,null,null,null,null,null,0,0,"E",null,null,null,null,null,null,null,null,0,null,0,"E",null,null,null,null,null,null,null,null,null,0,null,0,"E",null,null,null,null,null,null,null,null,null,0,null,0,"E","---","ERR","","----"]
[null,98,null,null,null,null,null,null,null,null,null,null,null,null,null,null,null,null,null,null,null,null,null,null,null,null,null,null,null,null,null,null,0,0,0,0,0,0,0,0,0,0,0,0,0,null,null,null,null,null,null,null,null,null,null,null,0,0,"E",null,null,null,null,null,null,null,null,null,null,0,0,"E",null,null,null,null,null,null,null,null,null,0,0,"E",null,null,null,null,null,null,null,null,null,null,null,0,0,"E",null,null,null,null,null,null,null,null,null,null,null,0,0,"E",null,null,null,null,null,null,null,null,null,null,0,0,"E",null,null,null,null,null,null,null,null,0,null,0,"E",null,null,null,null,null,null,null,null,null,0,null,0,"E",null,null,null,null,null,null,null,null,null,0,null,0,"E","---","ERR","","----"]
[null,99,null,null,null,null,null,null,null,null,null,null,null,null,null,null,null,null,null,null,null,null,null,null,null,null,null,null,null,null,null,null,0,0,0,0,0,0,0,0,0,0,0,0,0,null,null,null,null,null,null,null,null,null,null,null,0,0,"E",null,null,null,null,null,null,null,null,null,null,0,0,"E",null,null,null,null,null,null,null,null,null,0,0,"E",null,null,null,null,null,null,null,null,null,null,null,0,0,"E",null,null,null,null,null,null,null,null,null,null,null,0,0,"E",null,null,null,null,null,null,null,null,null,null,0,0,"E",null,null,null,null,null,null,null,null,0,null,0,"E",null,null,null,null,null,null,null,null,null,0,null,0,"E",null,null,null,null,null,null,null,null,null,0,null,0,"E","---","ERR","","----"]
[null,100,null,null,null,null,null,null,null,null,null,null,null,null,null,null,null,null,null,null,null,null,null,null,null,null,null,null,null,null,null,null,0,0,0,0,0,0,0,0,0,0,0,0,0,null,null,null,null,null,null,null,null,null,null,null,0,0,"E",null,null,null,null,null,null,null,null,null,null,0,0,"E",null,null,null,null,null,null,null,null,null,0,0,"E",null,null,null,null,null,null,null,null,null,null,null,0,0,"E",null,null,null,null,null,null,null,null,null,null,null,0,0,"E",null,null,null,null,null,null,null,null,null,null,0,0,"E",null,null,null,null,null,null,null,null,0,null,0,"E",null,null,null,null,null,null,null,null,null,0,null,0,"E",null,null,null,null,null,null,null,null,null,0,null,0,"E","---","ERR","","----"]
[null,101,null,null,null,null,null,null,null,null,null,null,null,null,null,null,null,null,null,null,null,null,null,null,null,null,null,null,null,null,null,null,0,0,0,0,0,0,0,0,0,0,0,0,0,null,null,null,null,null,null,null,null,null,null,null,0,0,"E",null,null,null,null,null,null,null,null,null,null,0,0,"E",null,null,null,null,null,null,null,null,null,0,0,"E",null,null,null,null,null,null,null,null,null,null,null,0,0,"E",null,null,null,null,null,null,null,null,null,null,null,0,0,"E",null,null,null,null,null,null,null,null,null,null,0,0,"E",null,null,null,null,null,null,null,null,0,null,0,"E",null,null,null,null,null,null,null,null,null,0,null,0,"E",null,null,null,null,null,null,null,null,null,0,null,0,"E","---","ERR","","----"]
[null,102,null,null,null,null,null,null,null,null,null,null,null,null,null,null,null,null,null,null,null,null,null,null,null,null,null,null,null,null,null,null,0,0,0,0,0,0,0,0,0,0,0,0,0,null,null,null,null,null,null,null,null,null,null,null,0,0,"E",null,null,null,null,null,null,null,null,null,null,0,0,"E",null,null,null,null,null,null,null,null,null,0,0,"E",null,null,null,null,null,null,null,null,null,null,null,0,0,"E",null,null,null,null,null,null,null,null,null,null,null,0,0,"E",null,null,null,null,null,null,null,null,null,null,0,0,"E",null,null,null,null,null,null,null,null,0,null,0,"E",null,null,null,null,null,null,null,null,null,0,null,0,"E",null,null,null,null,null,null,null,null,null,0,null,0,"E","---","ERR","","----"]
[null,103,null,null,null,null,null,null,null,null,null,null,null,null,null,null,null,null,null,null,null,null,null,null,null,null,null,null,null,null,null,null,0,0,0,0,0,0,0,0,0,0,0,0,0,null,null,null,null,null,null,null,null,null,null,null,0,0,"E",null,null,null,null,null,null,null,null,null,null,0,0,"E",null,null,null,null,null,null,null,null,null,0,0,"E",null,null,null,null,null,null,null,null,null,null,null,0,0,"E",null,null,null,null,null,null,null,null,null,null,null,0,0,"E",null,null,null,null,null,null,null,null,null,null,0,0,"E",null,null,null,null,null,null,null,null,0,null,0,"E",null,null,null,null,null,null,null,null,null,0,null,0,"E",null,null,null,null,null,null,null,null,null,0,null,0,"E","---","ERR","","----"]
[null,104,null,null,null,null,null,null,null,null,null,null,null,null,null,null,null,null,null,null,null,null,null,null,null,null,null,null,null,null,null,null,0,0,0,0,0,0,0,0,0,0,0,0,0,null,null,null,null,null,null,null,null,null,null,null,0,0,"E",null,null,null,null,null,null,null,null,null,null,0,0,"E",null,null,null,null,null,null,null,null,null,0,0,"E",null,null,null,null,null,null,null,null,null,null,null,0,0,"E",null,null,null,null,null,null,null,null,null,null,null,0,0,"E",null,null,null,null,null,null,null,null,null,null,0,0,"E",null,null,null,null,null,null,null,null,0,null,0,"E",null,null,null,null,null,null,null,null,null,0,null,0,"E",null,null,null,null,null,null,null,null,null,0,null,0,"E","---","ERR","","----"]
[null,105,null,null,null,null,null,null,null,null,null,null,null,null,null,null,null,null,null,null,null,null,null,null,null,null,null,null,null,null,null,null,0,0,0,0,0,0,0,0,0,0,0,0,0,null,null,null,null,null,null,null,null,null,null,null,0,0,"E",null,null,null,null,null,null,null,null,null,null,0,0,"E",null,null,null,null,null,null,null,null,null,0,0,"E",null,null,null,null,null,null,null,null,null,null,null,0,0,"E",null,null,null,null,null,null,null,null,null,null,null,0,0,"E",null,null,null,null,null,null,null,null,null,null,0,0,"E",null,null,null,null,null,null,null,null,0,null,0,"E",null,null,null,null,null,null,null,null,null,0,null,0,"E",null,null,null,null,null,null,null,null,null,0,null,0,"E","---","ERR","","----"]
[null,106,null,null,null,null,null,null,null,null,null,null,null,null,null,null,null,null,null,null,null,null,null,null,null,null,null,null,null,null,null,null,0,0,0,0,0,0,0,0,0,0,0,0,0,null,null,null,null,null,null,null,null,null,null,null,0,0,"E",null,null,null,null,null,null,null,null,null,null,0,0,"E",null,null,null,null,null,null,null,null,null,0,0,"E",null,null,null,null,null,null,null,null,null,null,null,0,0,"E",null,null,null,null,null,null,null,null,null,null,null,0,0,"E",null,null,null,null,null,null,null,null,null,null,0,0,"E",null,null,null,null,null,null,null,null,0,null,0,"E",null,null,null,null,null,null,null,null,null,0,null,0,"E",null,null,null,null,null,null,null,null,null,0,null,0,"E","---","ERR","","----"]
[null,107,null,null,null,null,null,null,null,null,null,null,null,null,null,null,null,null,null,null,null,null,null,null,null,null,null,null,null,null,null,null,0,0,0,0,0,0,0,0,0,0,0,0,0,null,null,null,null,null,null,null,null,null,null,null,0,0,"E",null,null,null,null,null,null,null,null,null,null,0,0,"E",null,null,null,null,null,null,null,null,null,0,0,"E",null,null,null,null,null,null,null,null,null,null,null,0,0,"E",null,null,null,null,null,null,null,null,null,null,null,0,0,"E",null,null,null,null,null,null,null,null,null,null,0,0,"E",null,null,null,null,null,null,null,null,0,null,0,"E",null,null,null,null,null,null,null,null,null,0,null,0,"E",null,null,null,null,null,null,null,null,null,0,null,0,"E","---","ERR","","----"]
[null,108,null,null,null,null,null,null,null,null,null,null,null,null,null,null,null,null,null,null,null,null,null,null,null,null,null,null,null,null,null,null,0,0,0,0,0,0,0,0,0,0,0,0,0,null,null,null,null,null,null,null,null,null,null,null,0,0,"E",null,null,null,null,null,null,null,null,null,null,0,0,"E",null,null,null,null,null,null,null,null,null,0,0,"E",null,null,null,null,null,null,null,null,null,null,null,0,0,"E",null,null,null,null,null,null,null,null,null,null,null,0,0,"E",null,null,null,null,null,null,null,null,null,null,0,0,"E",null,null,null,null,null,null,null,null,0,null,0,"E",null,null,null,null,null,null,null,null,null,0,null,0,"E",null,null,null,null,null,null,null,null,null,0,null,0,"E","---","ERR","","----"]
[null,109,null,null,null,null,null,null,null,null,null,null,null,null,null,null,null,null,null,null,null,null,null,null,null,null,null,null,null,null,null,null,0,0,0,0,0,0,0,0,0,0,0,0,0,null,null,null,null,null,null,null,null,null,null,null,0,0,"E",null,null,null,null,null,null,null,null,null,null,0,0,"E",null,null,null,null,null,null,null,null,null,0,0,"E",null,null,null,null,null,null,null,null,null,null,null,0,0,"E",null,null,null,null,null,null,null,null,null,null,null,0,0,"E",null,null,null,null,null,null,null,null,null,null,0,0,"E",null,null,null,null,null,null,null,null,0,null,0,"E",null,null,null,null,null,null,null,null,null,0,null,0,"E",null,null,null,null,null,null,null,null,null,0,null,0,"E","---","ERR","","----"]
[null,110,null,null,null,null,null,null,null,null,null,null,null,null,null,null,null,null,null,null,null,null,null,null,null,null,null,null,null,null,null,null,0,0,0,0,0,0,0,0,0,0,0,0,0,null,null,null,null,null,null,null,null,null,null,null,0,0,"E",null,null,null,null,null,null,null,null,null,null,0,0,"E",null,null,null,null,null,null,null,null,null,0,0,"E",null,null,null,null,null,null,null,null,null,null,null,0,0,"E",null,null,null,null,null,null,null,null,null,null,null,0,0,"E",null,null,null,null,null,null,null,null,null,null,0,0,"E",null,null,null,null,null,null,null,null,0,null,0,"E",null,null,null,null,null,null,null,null,null,0,null,0,"E",null,null,null,null,null,null,null,null,null,0,null,0,"E","---","ERR","","----"]
[null,111,null,null,null,null,null,null,null,null,null,null,null,null,null,null,null,null,null,null,null,null,null,null,null,null,null,null,null,null,null,null,0,0,0,0,0,0,0,0,0,0,0,0,0,null,null,null,null,null,null,null,null,null,null,null,0,0,"E",null,null,null,null,null,null,null,null,null,null,0,0,"E",null,null,null,null,null,null,null,null,null,0,0,"E",null,null,null,null,null,null,null,null,null,null,null,0,0,"E",null,null,null,null,null,null,null,null,null,null,null,0,0,"E",null,null,null,null,null,null,null,null,null,null,0,0,"E",null,null,null,null,null,null,null,null,0,null,0,"E",null,null,null,null,null,null,null,null,null,0,null,0,"E",null,null,null,null,null,null,null,null,null,0,null,0,"E","---","ERR","","----"]
[null,112,null,null,null,null,null,null,null,null,null,null,null,null,null,null,null,null,null,null,null,null,null,null,null,null,null,null,null,null,null,null,0,0,0,0,0,0,0,0,0,0,0,0,0,null,null,null,null,null,null,null,null,null,null,null,0,0,"E",null,null,null,null,null,null,null,null,null,null,0,0,"E",null,null,null,null,null,null,null,null,null,0,0,"E",null,null,null,null,null,null,null,null,null,null,null,0,0,"E",null,null,null,null,null,null,null,null,null,null,null,0,0,"E",null,null,null,null,null,null,null,null,null,null,0,0,"E",null,null,null,null,null,null,null,null,0,null,0,"E",null,null,null,null,null,null,null,null,null,0,null,0,"E",null,null,null,null,null,null,null,null,null,0,null,0,"E","---","ERR","","----"]
[null,113,null,null,null,null,null,null,null,null,null,null,null,null,null,null,null,null,null,null,null,null,null,null,null,null,null,null,null,null,null,null,0,0,0,0,0,0,0,0,0,0,0,0,0,null,null,null,null,null,null,null,null,null,null,null,0,0,"E",null,null,null,null,null,null,null,null,null,null,0,0,"E",null,null,null,null,null,null,null,null,null,0,0,"E",null,null,null,null,null,null,null,null,null,null,null,0,0,"E",null,null,null,null,null,null,null,null,null,null,null,0,0,"E",null,null,null,null,null,null,null,null,null,null,0,0,"E",null,null,null,null,null,null,null,null,0,null,0,"E",null,null,null,null,null,null,null,null,null,0,null,0,"E",null,null,null,null,null,null,null,null,null,0,null,0,"E","---","ERR","","----"]
[null,114,null,null,null,null,null,null,null,null,null,null,null,null,null,null,null,null,null,null,null,null,null,null,null,null,null,null,null,null,null,null,0,0,0,0,0,0,0,0,0,0,0,0,0,null,null,null,null,null,null,null,null,null,null,null,0,0,"E",null,null,null,null,null,null,null,null,null,null,0,0,"E",null,null,null,null,null,null,null,null,null,0,0,"E",null,null,null,null,null,null,null,null,null,null,null,0,0,"E",null,null,null,null,null,null,null,null,null,null,null,0,0,"E",null,null,null,null,null,null,null,null,null,null,0,0,"E",null,null,null,null,null,null,null,null,0,null,0,"E",null,null,null,null,null,null,null,null,null,0,null,0,"E",null,null,null,null,null,null,null,null,null,0,null,0,"E","---","ERR","","----"]
[null,115,null,null,null,null,null,null,null,null,null,null,null,null,null,null,null,null,null,null,null,null,null,null,null,null,null,null,null,null,null,null,0,0,0,0,0,0,0,0,0,0,0,0,0,null,null,null,null,null,null,null,null,null,null,null,0,0,"E",null,null,null,null,null,null,null,null,null,null,0,0,"E",null,null,null,null,null,null,null,null,null,0,0,"E",null,null,null,null,null,null,null,null,null,null,null,0,0,"E",null,null,null,null,null,null,null,null,null,null,null,0,0,"E",null,null,null,null,null,null,null,null,null,null,0,0,"E",null,null,null,null,null,null,null,null,0,null,0,"E",null,null,null,null,null,null,null,null,null,0,null,0,"E",null,null,null,null,null,null,null,null,null,0,null,0,"E","---","ERR","","----"]
[null,116,null,null,null,null,null,null,null,null,null,null,null,null,null,null,null,null,null,null,null,null,null,null,null,null,null,null,null,null,null,null,0,0,0,0,0,0,0,0,0,0,0,0,0,null,null,null,null,null,null,null,null,null,null,null,0,0,"E",null,null,null,null,null,null,null,null,null,null,0,0,"E",null,null,null,null,null,null,null,null,null,0,0,"E",null,null,null,null,null,null,null,null,null,null,null,0,0,"E",null,null,null,null,null,null,null,null,null,null,null,0,0,"E",null,null,null,null,null,null,null,null,null,null,0,0,"E",null,null,null,null,null,null,null,null,0,null,0,"E",null,null,null,null,null,null,null,null,null,0,null,0,"E",null,null,null,null,null,null,null,null,null,0,null,0,"E","---","ERR","","----"]
[null,117,null,null,null,null,null,null,null,null,null,null,null,null,null,null,null,null,null,null,null,null,null,null,null,null,null,null,null,null,null,null,0,0,0,0,0,0,0,0,0,0,0,0,0,null,null,null,null,null,null,null,null,null,null,null,0,0,"E",null,null,null,null,null,null,null,null,null,null,0,0,"E",null,null,null,null,null,null,null,null,null,0,0,"E",null,null,null,null,null,null,null,null,null,null,null,0,0,"E",null,null,null,null,null,null,null,null,null,null,null,0,0,"E",null,null,null,null,null,null,null,null,null,null,0,0,"E",null,null,null,null,null,null,null,null,0,null,0,"E",null,null,null,null,null,null,null,null,null,0,null,0,"E",null,null,null,null,null,null,null,null,null,0,null,0,"E","---","ERR","","----"]
[null,118,null,null,null,null,null,null,null,null,null,null,null,null,null,null,null,null,null,null,null,null,null,null,null,null,null,null,null,null,null,null,0,0,0,0,0,0,0,0,0,0,0,0,0,null,null,null,null,null,null,null,null,null,null,null,0,0,"E",null,null,null,null,null,null,null,null,null,null,0,0,"E",null,null,null,null,null,null,null,null,null,0,0,"E",null,null,null,null,null,null,null,null,null,null,null,0,0,"E",null,null,null,null,null,null,null,null,null,null,null,0,0,"E",null,null,null,null,null,null,null,null,null,null,0,0,"E",null,null,null,null,null,null,null,null,0,null,0,"E",null,null,null,null,null,null,null,null,null,0,null,0,"E",null,null,null,null,null,null,null,null,null,0,null,0,"E","---","ERR","","----"]
[null,119,null,null,null,null,null,null,null,null,null,null,null,null,null,null,null,null,null,null,null,null,null,null,null,null,null,null,null,null,null,null,0,0,0,0,0,0,0,0,0,0,0,0,0,null,null,null,null,null,null,null,null,null,null,null,0,0,"E",null,null,null,null,null,null,null,null,null,null,0,0,"E",null,null,null,null,null,null,null,null,null,0,0,"E",null,null,null,null,null,null,null,null,null,null,null,0,0,"E",null,null,null,null,null,null,null,null,null,null,null,0,0,"E",null,null,null,null,null,null,null,null,null,null,0,0,"E",null,null,null,null,null,null,null,null,0,null,0,"E",null,null,null,null,null,null,null,null,null,0,null,0,"E",null,null,null,null,null,null,null,null,null,0,null,0,"E","---","ERR","","----"]
[null,120,null,null,null,null,null,null,null,null,null,null,null,null,null,null,null,null,null,null,null,null,null,null,null,null,null,null,null,null,null,null,0,0,0,0,0,0,0,0,0,0,0,0,0,null,null,null,null,null,null,null,null,null,null,null,0,0,"E",null,null,null,null,null,null,null,null,null,null,0,0,"E",null,null,null,null,null,null,null,null,null,0,0,"E",null,null,null,null,null,null,null,null,null,null,null,0,0,"E",null,null,null,null,null,null,null,null,null,null,null,0,0,"E",null,null,null,null,null,null,null,null,null,null,0,0,"E",null,null,null,null,null,null,null,null,0,null,0,"E",null,null,null,null,null,null,null,null,null,0,null,0,"E",null,null,null,null,null,null,null,null,null,0,null,0,"E","---","ERR","","----"]
[null,121,null,null,null,null,null,null,null,null,null,null,null,null,null,null,null,null,null,null,null,null,null,null,null,null,null,null,null,null,null,null,0,0,0,0,0,0,0,0,0,0,0,0,0,null,null,null,null,null,null,null,null,null,null,null,0,0,"E",null,null,null,null,null,null,null,null,null,null,0,0,"E",null,null,null,null,null,null,null,null,null,0,0,"E",null,null,null,null,null,null,null,null,null,null,null,0,0,"E",null,null,null,null,null,null,null,null,null,null,null,0,0,"E",null,null,null,null,null,null,null,null,null,null,0,0,"E",null,null,null,null,null,null,null,null,0,null,0,"E",null,null,null,null,null,null,null,null,null,0,null,0,"E",null,null,null,null,null,null,null,null,null,0,null,0,"E","---","ERR","","----"]
[null,122,null,null,null,null,null,null,null,null,null,null,null,null,null,null,null,null,null,null,null,null,null,null,null,null,null,null,null,null,null,null,0,0,0,0,0,0,0,0,0,0,0,0,0,null,null,null,null,null,null,null,null,null,null,null,0,0,"E",null,null,null,null,null,null,null,null,null,null,0,0,"E",null,null,null,null,null,null,null,null,null,0,0,"E",null,null,null,null,null,null,null,null,null,null,null,0,0,"E",null,null,null,null,null,null,null,null,null,null,null,0,0,"E",null,null,null,null,null,null,null,null,null,null,0,0,"E",null,null,null,null,null,null,null,null,0,null,0,"E",null,null,null,null,null,null,null,null,null,0,null,0,"E",null,null,null,null,null,null,null,null,null,0,null,0,"E","---","ERR","","----"]
[null,123,null,null,null,null,null,null,null,null,null,null,null,null,null,null,null,null,null,null,null,null,null,null,null,null,null,null,null,null,null,null,0,0,0,0,0,0,0,0,0,0,0,0,0,null,null,null,null,null,null,null,null,null,null,null,0,0,"E",null,null,null,null,null,null,null,null,null,null,0,0,"E",null,null,null,null,null,null,null,null,null,0,0,"E",null,null,null,null,null,null,null,null,null,null,null,0,0,"E",null,null,null,null,null,null,null,null,null,null,null,0,0,"E",null,null,null,null,null,null,null,null,null,null,0,0,"E",null,null,null,null,null,null,null,null,0,null,0,"E",null,null,null,null,null,null,null,null,null,0,null,0,"E",null,null,null,null,null,null,null,null,null,0,null,0,"E","---","ERR","","----"]
[null,124,null,null,null,null,null,null,null,null,null,null,null,null,null,null,null,null,null,null,null,null,null,null,null,null,null,null,null,null,null,null,0,0,0,0,0,0,0,0,0,0,0,0,0,null,null,null,null,null,null,null,null,null,null,null,0,0,"E",null,null,null,null,null,null,null,null,null,null,0,0,"E",null,null,null,null,null,null,null,null,null,0,0,"E",null,null,null,null,null,null,null,null,null,null,null,0,0,"E",null,null,null,null,null,null,null,null,null,null,null,0,0,"E",null,null,null,null,null,null,null,null,null,null,0,0,"E",null,null,null,null,null,null,null,null,0,null,0,"E",null,null,null,null,null,null,null,null,null,0,null,0,"E",null,null,null,null,null,null,null,null,null,0,null,0,"E","---","ERR","","----"]
[null,125,null,null,null,null,null,null,null,null,null,null,null,null,null,null,null,null,null,null,null,null,null,null,null,null,null,null,null,null,null,null,0,0,0,0,0,0,0,0,0,0,0,0,0,null,null,null,null,null,null,null,null,null,null,null,0,0,"E",null,null,null,null,null,null,null,null,null,null,0,0,"E",null,null,null,null,null,null,null,null,null,0,0,"E",null,null,null,null,null,null,null,null,null,null,null,0,0,"E",null,null,null,null,null,null,null,null,null,null,null,0,0,"E",null,null,null,null,null,null,null,null,null,null,0,0,"E",null,null,null,null,null,null,null,null,0,null,0,"E",null,null,null,null,null,null,null,null,null,0,null,0,"E",null,null,null,null,null,null,null,null,null,0,null,0,"E","---","ERR","","----"]
[null,126,null,null,null,null,null,null,null,null,null,null,null,null,null,null,null,null,null,null,null,null,null,null,null,null,null,null,null,null,null,null,0,0,0,0,0,0,0,0,0,0,0,0,0,null,null,null,null,null,null,null,null,null,null,null,0,0,"E",null,null,null,null,null,null,null,null,null,null,0,0,"E",null,null,null,null,null,null,null,null,null,0,0,"E",null,null,null,null,null,null,null,null,null,null,null,0,0,"E",null,null,null,null,null,null,null,null,null,null,null,0,0,"E",null,null,null,null,null,null,null,null,null,null,0,0,"E",null,null,null,null,null,null,null,null,0,null,0,"E",null,null,null,null,null,null,null,null,null,0,null,0,"E",null,null,null,null,null,null,null,null,null,0,null,0,"E","---","ERR","","----"]
[null,127,null,null,null,null,null,null,null,null,null,null,null,null,null,null,null,null,null,null,null,null,null,null,null,null,null,null,null,null,null,null,0,0,0,0,0,0,0,0,0,0,0,0,0,null,null,null,null,null,null,null,null,null,null,null,0,0,"E",null,null,null,null,null,null,null,null,null,null,0,0,"E",null,null,null,null,null,null,null,null,null,0,0,"E",null,null,null,null,null,null,null,null,null,null,null,0,0,"E",null,null,null,null,null,null,null,null,null,null,null,0,0,"E",null,null,null,null,null,null,null,null,null,null,0,0,"E",null,null,null,null,null,null,null,null,0,null,0,"E",null,null,null,null,null,null,null,null,null,0,null,0,"E",null,null,null,null,null,null,null,null,null,0,null,0,"E","---","ERR","","----"]
[null,128,null,null,null,null,null,null,null,null,null,null,null,null,null,null,null,null,null,null,null,null,null,null,null,null,null,null,null,null,null,null,0,0,0,0,0,0,0,0,0,0,0,0,0,null,null,null,null,null,null,null,null,null,null,null,0,0,"E",null,null,null,null,null,null,null,null,null,null,0,0,"E",null,null,null,null,null,null,null,null,null,0,0,"E",null,null,null,null,null,null,null,null,null,null,null,0,0,"E",null,null,null,null,null,null,null,null,null,null,null,0,0,"E",null,null,null,null,null,null,null,null,null,null,0,0,"E",null,null,null,null,null,null,null,null,0,null,0,"E",null,null,null,null,null,null,null,null,null,0,null,0,"E",null,null,null,null,null,null,null,null,null,0,null,0,"E","---","ERR","","----"]
[null,129,null,null,null,null,null,null,null,null,null,null,null,null,null,null,null,null,null,null,null,null,null,null,null,null,null,null,null,null,null,null,0,0,0,0,0,0,0,0,0,0,0,0,0,null,null,null,null,null,null,null,null,null,null,null,0,0,"E",null,null,null,null,null,null,null,null,null,null,0,0,"E",null,null,null,null,null,null,null,null,null,0,0,"E",null,null,null,null,null,null,null,null,null,null,null,0,0,"E",null,null,null,null,null,null,null,null,null,null,null,0,0,"E",null,null,null,null,null,null,null,null,null,null,0,0,"E",null,null,null,null,null,null,null,null,0,null,0,"E",null,null,null,null,null,null,null,null,null,0,null,0,"E",null,null,null,null,null,null,null,null,null,0,null,0,"E","---","ERR","","----"]
[null,130,null,null,null,null,null,null,null,null,null,null,null,null,null,null,null,null,null,null,null,null,null,null,null,null,null,null,null,null,null,null,{"$f":"SUM(V136:AF136)","v":0},{"$f":"V136/$V$4","v":0},{"$f":"W136/$W$4","v":0},{"$f":"X136/$X$4","v":0},{"$f":"Y136/$Y$4","v":0},{"$f":"Z136/$Z$4","v":0},{"$f":"AA136/$AA$4","v":0},{"$f":"AB136/$AB$4","v":0},{"$f":"AC136/$AC$4","v":0},{"$f":"AD136/$AD$4","v":0},{"$f":"AE136/$AE$4","v":0},{"$f":"AF136/$AF$4","v":0},{"$f":"AG136/$AG$4","v":0},null,null,null,null,null,null,null,null,null,null,null,{"$f":"SUM(AZ136:BD136)","v":0},{"$f":"BE136+AY136","v":0},{"$f":"IFERROR(IF(BF136>90,\"A+\",IF(BF136>80,\"A\",IF(BF136>70,\"B+\",IF(BF136>60,\"B\",IF(BF136>50,\"C+\",IF(BF136>40,\"C\",IF(BF136>=33,\"D\",\"E\"))))))),\"Abs\")","v":"E"},null,null,null,null,null,null,null,null,null,null,{"$f":"SUM(BM136:BQ136)","v":0},{"$f":"BR136+BL136","v":0},{"$f":"IFERROR(IF(BS136>90,\"A+\",IF(BS136>80,\"A\",IF(BS136>70,\"B+\",IF(BS136>60,\"B\",IF(BS136>50,\"C+\",IF(BS136>40,\"C\",IF(BS136>=33,\"D\",\"E\"))))))),\"Abs\")","v":"E"},null,null,null,null,null,null,null,null,null,{"$f":"SUM(BZ136:CC136)","v":0},{"$f":"CD136+BY136","v":0},{"$f":"IFERROR(IF(CE136>90,\"A+\",IF(CE136>80,\"A\",IF(CE136>70,\"B+\",IF(CE136>60,\"B\",IF(CE136>50,\"C+\",IF(CE136>40,\"C\",IF(CE136>=33,\"D\",\"E\"))))))),\"Abs\")","v":"E"},null,null,null,null,null,null,null,null,null,null,null,{"$f":"SUM(CL136:CQ136)","v":0},{"$f":"CR136+CK136","v":0},{"$f":"IFERROR(IF(CS136>90,\"A+\",IF(CS136>80,\"A\",IF(CS136>70,\"B+\",IF(CS136>60,\"B\",IF(CS136>50,\"C+\",IF(CS136>40,\"C\",IF(CS136>=33,\"D\",\"E\"))))))),\"Abs\")","v":"E"},null,null,null,null,null,null,null,null,null,null,null,{"$f":"SUM(CZ136:DE136)","v":0},{"$f":"DF136+CY136","v":0},{"$f":"IFERROR(IF(DG136>90,\"A+\",IF(DG136>80,\"A\",IF(DG136>70,\"B+\",IF(DG136>60,\"B\",IF(DG136>50,\"C+\",IF(DG136>40,\"C\",IF(DG136>=33,\"D\",\"E\"))))))),\"Abs\")","v":"E"},null,null,null,null,null,null,null,null,null,null,{"$f":"SUM(DN136:DR136)","v":0},{"$f":"DS136+DM136","v":0},{"$f":"IFERROR(IF(DT136>90,\"A+\",IF(DT136>80,\"A\",IF(DT136>70,\"B+\",IF(DT136>60,\"B\",IF(DT136>50,\"C+\",IF(DT136>40,\"C\",IF(DT136>=33,\"D\",\"E\"))))))),\"Abs\")","v":"E"},null,null,null,null,null,null,null,null,{"$f":"SUM(EA136:EC136)","v":0},null,{"$f":"EE136+ED136+DZ136","v":0},{"$f":"IFERROR(IF(EF136>90,\"A+\",IF(EF136>80,\"A\",IF(EF136>70,\"B+\",IF(EF136>60,\"B\",IF(EF136>50,\"C+\",IF(EF136>40,\"C\",IF(EF136>=33,\"D\",\"E\"))))))),\"Abs\")","v":"E"},null,null,null,null,null,null,null,null,null,{"$f":"SUM(EM136:EP136)","v":0},null,{"$f":"ER136+EQ136+EL136","v":0},{"$f":"IFERROR(IF(ES136>90,\"A+\",IF(ES136>80,\"A\",IF(ES136>70,\"B+\",IF(ES136>60,\"B\",IF(ES136>50,\"C+\",IF(ES136>40,\"C\",IF(ES136>=33,\"D\",\"E\"))))))),\"Abs\")","v":"E"},null,null,null,null,null,null,null,null,null,{"$f":"SUM(EZ136:FC136)","v":0},null,{"$f":"FE136+FD136+EY136","v":0},{"$f":"IFERROR(IF(FF136>90,\"A+\",IF(FF136>80,\"A\",IF(FF136>70,\"B+\",IF(FF136>60,\"B\",IF(FF136>50,\"C+\",IF(FF136>40,\"C\",IF(FF136>=33,\"D\",\"E\"))))))),\"Abs\")","v":"E"},{"$f":"IF(AND(MIN(AY136,BL136,BY136,CK136,CY136,DM136)>19,MIN(BF136,BS136,CE136,CS136,DG136,DT136)>32),SUM(BF136,BS136,CE136,CS136,DG136,DT136),\"---\")","v":"---"},{"$f":"IFERROR(FH136/600*100,\"ERR\")","v":"ERR"},{"$f":"IF(FI136=\"ERR\",\"\",(IF(FI136>90,\"A+\",IF(FI136>80,\"A\",IF(FI136>70,\"B+\",IF(FI136>60,\"B\",IF(FI136>50,\"C+\",IF(FI136>40,\"C\",IF(FI136>=33,\"D\",IF(FI136<33,\"E\",\"\"))))))))))","v":""},{"$f":"IF(FI136=\"ERR\",\"----\",IF(FI136>=33,\"ਪਾਸ\",\"--\"))","v":"----"}]
[null,131,null,null,null,null,null,null,null,null,null,null,null,null,null,null,null,null,null,null,null,null,null,null,null,null,null,null,null,null,null,null,0,0,0,0,0,0,0,0,0,0,0,0,0,null,null,null,null,null,null,null,null,null,null,null,0,0,"E",null,null,null,null,null,null,null,null,null,null,0,0,"E",null,null,null,null,null,null,null,null,null,0,0,"E",null,null,null,null,null,null,null,null,null,null,null,0,0,"E",null,null,null,null,null,null,null,null,null,null,null,0,0,"E",null,null,null,null,null,null,null,null,null,null,0,0,"E",null,null,null,null,null,null,null,null,0,null,0,"E",null,null,null,null,null,null,null,null,null,0,null,0,"E",null,null,null,null,null,null,null,null,null,0,null,0,"E","---","ERR","","----"]
[null,132,null,null,null,null,null,null,null,null,null,null,null,null,null,null,null,null,null,null,null,null,null,null,null,null,null,null,null,null,null,null,0,0,0,0,0,0,0,0,0,0,0,0,0,null,null,null,null,null,null,null,null,null,null,null,0,0,"E",null,null,null,null,null,null,null,null,null,null,0,0,"E",null,null,null,null,null,null,null,null,null,0,0,"E",null,null,null,null,null,null,null,null,null,null,null,0,0,"E",null,null,null,null,null,null,null,null,null,null,null,0,0,"E",null,null,null,null,null,null,null,null,null,null,0,0,"E",null,null,null,null,null,null,null,null,0,null,0,"E",null,null,null,null,null,null,null,null,null,0,null,0,"E",null,null,null,null,null,null,null,null,null,0,null,0,"E","---","ERR","","----"]
[null,133,null,null,null,null,null,null,null,null,null,null,null,null,null,null,null,null,null,null,null,null,null,null,null,null,null,null,null,null,null,null,0,0,0,0,0,0,0,0,0,0,0,0,0,null,null,null,null,null,null,null,null,null,null,null,0,0,"E",null,null,null,null,null,null,null,null,null,null,0,0,"E",null,null,null,null,null,null,null,null,null,0,0,"E",null,null,null,null,null,null,null,null,null,null,null,0,0,"E",null,null,null,null,null,null,null,null,null,null,null,0,0,"E",null,null,null,null,null,null,null,null,null,null,0,0,"E",null,null,null,null,null,null,null,null,0,null,0,"E",null,null,null,null,null,null,null,null,null,0,null,0,"E",null,null,null,null,null,null,null,null,null,0,null,0,"E","---","ERR","","----"]
[null,134,null,null,null,null,null,null,null,null,null,null,null,null,null,null,null,null,null,null,null,null,null,null,null,null,null,null,null,null,null,null,0,0,0,0,0,0,0,0,0,0,0,0,0,null,null,null,null,null,null,null,null,null,null,null,0,0,"E",null,null,null,null,null,null,null,null,null,null,0,0,"E",null,null,null,null,null,null,null,null,null,0,0,"E",null,null,null,null,null,null,null,null,null,null,null,0,0,"E",null,null,null,null,null,null,null,null,null,null,null,0,0,"E",null,null,null,null,null,null,null,null,null,null,0,0,"E",null,null,null,null,null,null,null,null,0,null,0,"E",null,null,null,null,null,null,null,null,null,0,null,0,"E",null,null,null,null,null,null,null,null,null,0,null,0,"E","---","ERR","","----"]
[null,135,null,null,null,null,null,null,null,null,null,null,null,null,null,null,null,null,null,null,null,null,null,null,null,null,null,null,null,null,null,null,0,0,0,0,0,0,0,0,0,0,0,0,0,null,null,null,null,null,null,null,null,null,null,null,0,0,"E",null,null,null,null,null,null,null,null,null,null,0,0,"E",null,null,null,null,null,null,null,null,null,0,0,"E",null,null,null,null,null,null,null,null,null,null,null,0,0,"E",null,null,null,null,null,null,null,null,null,null,null,0,0,"E",null,null,null,null,null,null,null,null,null,null,0,0,"E",null,null,null,null,null,null,null,null,0,null,0,"E",null,null,null,null,null,null,null,null,null,0,null,0,"E",null,null,null,null,null,null,null,null,null,0,null,0,"E","---","ERR","","----"]
[null,136,null,null,null,null,null,null,null,null,null,null,null,null,null,null,null,null,null,null,null,null,null,null,null,null,null,null,null,null,null,null,0,0,0,0,0,0,0,0,0,0,0,0,0,null,null,null,null,null,null,null,null,null,null,null,0,0,"E",null,null,null,null,null,null,null,null,null,null,0,0,"E",null,null,null,null,null,null,null,null,null,0,0,"E",null,null,null,null,null,null,null,null,null,null,null,0,0,"E",null,null,null,null,null,null,null,null,null,null,null,0,0,"E",null,null,null,null,null,null,null,null,null,null,0,0,"E",null,null,null,null,null,null,null,null,0,null,0,"E",null,null,null,null,null,null,null,null,null,0,null,0,"E",null,null,null,null,null,null,null,null,null,0,null,0,"E","---","ERR","","----"]
[null,137,null,null,null,null,null,null,null,null,null,null,null,null,null,null,null,null,null,null,null,null,null,null,null,null,null,null,null,null,null,null,0,0,0,0,0,0,0,0,0,0,0,0,0,null,null,null,null,null,null,null,null,null,null,null,0,0,"E",null,null,null,null,null,null,null,null,null,null,0,0,"E",null,null,null,null,null,null,null,null,null,0,0,"E",null,null,null,null,null,null,null,null,null,null,null,0,0,"E",null,null,null,null,null,null,null,null,null,null,null,0,0,"E",null,null,null,null,null,null,null,null,null,null,0,0,"E",null,null,null,null,null,null,null,null,0,null,0,"E",null,null,null,null,null,null,null,null,null,0,null,0,"E",null,null,null,null,null,null,null,null,null,0,null,0,"E","---","ERR","","----"]
[null,138,null,null,null,null,null,null,null,null,null,null,null,null,null,null,null,null,null,null,null,null,null,null,null,null,null,null,null,null,null,null,0,0,0,0,0,0,0,0,0,0,0,0,0,null,null,null,null,null,null,null,null,null,null,null,0,0,"E",null,null,null,null,null,null,null,null,null,null,0,0,"E",null,null,null,null,null,null,null,null,null,0,0,"E",null,null,null,null,null,null,null,null,null,null,null,0,0,"E",null,null,null,null,null,null,null,null,null,null,null,0,0,"E",null,null,null,null,null,null,null,null,null,null,0,0,"E",null,null,null,null,null,null,null,null,0,null,0,"E",null,null,null,null,null,null,null,null,null,0,null,0,"E",null,null,null,null,null,null,null,null,null,0,null,0,"E","---","ERR","","----"]
[null,139,null,null,null,null,null,null,null,null,null,null,null,null,null,null,null,null,null,null,null,null,null,null,null,null,null,null,null,null,null,null,0,0,0,0,0,0,0,0,0,0,0,0,0,null,null,null,null,null,null,null,null,null,null,null,0,0,"E",null,null,null,null,null,null,null,null,null,null,0,0,"E",null,null,null,null,null,null,null,null,null,0,0,"E",null,null,null,null,null,null,null,null,null,null,null,0,0,"E",null,null,null,null,null,null,null,null,null,null,null,0,0,"E",null,null,null,null,null,null,null,null,null,null,0,0,"E",null,null,null,null,null,null,null,null,0,null,0,"E",null,null,null,null,null,null,null,null,null,0,null,0,"E",null,null,null,null,null,null,null,null,null,0,null,0,"E","---","ERR","","----"]
[null,140,null,null,null,null,null,null,null,null,null,null,null,null,null,null,null,null,null,null,null,null,null,null,null,null,null,null,null,null,null,null,0,0,0,0,0,0,0,0,0,0,0,0,0,null,null,null,null,null,null,null,null,null,null,null,0,0,"E",null,null,null,null,null,null,null,null,null,null,0,0,"E",null,null,null,null,null,null,null,null,null,0,0,"E",null,null,null,null,null,null,null,null,null,null,null,0,0,"E",null,null,null,null,null,null,null,null,null,null,null,0,0,"E",null,null,null,null,null,null,null,null,null,null,0,0,"E",null,null,null,null,null,null,null,null,0,null,0,"E",null,null,null,null,null,null,null,null,null,0,null,0,"E",null,null,null,null,null,null,null,null,null,0,null,0,"E","---","ERR","","----"]
[null,141,null,null,null,null,null,null,null,null,null,null,null,null,null,null,null,null,null,null,null,null,null,null,null,null,null,null,null,null,null,null,0,0,0,0,0,0,0,0,0,0,0,0,0,null,null,null,null,null,null,null,null,null,null,null,0,0,"E",null,null,null,null,null,null,null,null,null,null,0,0,"E",null,null,null,null,null,null,null,null,null,0,0,"E",null,null,null,null,null,null,null,null,null,null,null,0,0,"E",null,null,null,null,null,null,null,null,null,null,null,0,0,"E",null,null,null,null,null,null,null,null,null,null,0,0,"E",null,null,null,null,null,null,null,null,0,null,0,"E",null,null,null,null,null,null,null,null,null,0,null,0,"E",null,null,null,null,null,null,null,null,null,0,null,0,"E","---","ERR","","----"]
[null,142,null,null,null,null,null,null,null,null,null,null,null,null,null,null,null,null,null,null,null,null,null,null,null,null,null,null,null,null,null,null,0,0,0,0,0,0,0,0,0,0,0,0,0,null,null,null,null,null,null,null,null,null,null,null,0,0,"E",null,null,null,null,null,null,null,null,null,null,0,0,"E",null,null,null,null,null,null,null,null,null,0,0,"E",null,null,null,null,null,null,null,null,null,null,null,0,0,"E",null,null,null,null,null,null,null,null,null,null,null,0,0,"E",null,null,null,null,null,null,null,null,null,null,0,0,"E",null,null,null,null,null,null,null,null,0,null,0,"E",null,null,null,null,null,null,null,null,null,0,null,0,"E",null,null,null,null,null,null,null,null,null,0,null,0,"E","---","ERR","","----"]
[null,143,null,null,null,null,null,null,null,null,null,null,null,null,null,null,null,null,null,null,null,null,null,null,null,null,null,null,null,null,null,null,0,0,0,0,0,0,0,0,0,0,0,0,0,null,null,null,null,null,null,null,null,null,null,null,0,0,"E",null,null,null,null,null,null,null,null,null,null,0,0,"E",null,null,null,null,null,null,null,null,null,0,0,"E",null,null,null,null,null,null,null,null,null,null,null,0,0,"E",null,null,null,null,null,null,null,null,null,null,null,0,0,"E",null,null,null,null,null,null,null,null,null,null,0,0,"E",null,null,null,null,null,null,null,null,0,null,0,"E",null,null,null,null,null,null,null,null,null,0,null,0,"E",null,null,null,null,null,null,null,null,null,0,null,0,"E","---","ERR","","----"]
[null,144,null,null,null,null,null,null,null,null,null,null,null,null,null,null,null,null,null,null,null,null,null,null,null,null,null,null,null,null,null,null,0,0,0,0,0,0,0,0,0,0,0,0,0,null,null,null,null,null,null,null,null,null,null,null,0,0,"E",null,null,null,null,null,null,null,null,null,null,0,0,"E",null,null,null,null,null,null,null,null,null,0,0,"E",null,null,null,null,null,null,null,null,null,null,null,0,0,"E",null,null,null,null,null,null,null,null,null,null,null,0,0,"E",null,null,null,null,null,null,null,null,null,null,0,0,"E",null,null,null,null,null,null,null,null,0,null,0,"E",null,null,null,null,null,null,null,null,null,0,null,0,"E",null,null,null,null,null,null,null,null,null,0,null,0,"E","---","ERR","","----"]
[null,145,null,null,null,null,null,null,null,null,null,null,null,null,null,null,null,null,null,null,null,null,null,null,null,null,null,null,null,null,null,null,0,0,0,0,0,0,0,0,0,0,0,0,0,null,null,null,null,null,null,null,null,null,null,null,0,0,"E",null,null,null,null,null,null,null,null,null,null,0,0,"E",null,null,null,null,null,null,null,null,null,0,0,"E",null,null,null,null,null,null,null,null,null,null,null,0,0,"E",null,null,null,null,null,null,null,null,null,null,null,0,0,"E",null,null,null,null,null,null,null,null,null,null,0,0,"E",null,null,null,null,null,null,null,null,0,null,0,"E",null,null,null,null,null,null,null,null,null,0,null,0,"E",null,null,null,null,null,null,null,null,null,0,null,0,"E","---","ERR","","----"]
[null,146,null,null,null,null,null,null,null,null,null,null,null,null,null,null,null,null,null,null,null,null,null,null,null,null,null,null,null,null,null,null,0,0,0,0,0,0,0,0,0,0,0,0,0,null,null,null,null,null,null,null,null,null,null,null,0,0,"E",null,null,null,null,null,null,null,null,null,null,0,0,"E",null,null,null,null,null,null,null,null,null,0,0,"E",null,null,null,null,null,null,null,null,null,null,null,0,0,"E",null,null,null,null,null,null,null,null,null,null,null,0,0,"E",null,null,null,null,null,null,null,null,null,null,0,0,"E",null,null,null,null,null,null,null,null,0,null,0,"E",null,null,null,null,null,null,null,null,null,0,null,0,"E",null,null,null,null,null,null,null,null,null,0,null,0,"E","---","ERR","","----"]
[null,147,null,null,null,null,null,null,null,null,null,null,null,null,null,null,null,null,null,null,null,null,null,null,null,null,null,null,null,null,null,null,0,0,0,0,0,0,0,0,0,0,0,0,0,null,null,null,null,null,null,null,null,null,null,null,0,0,"E",null,null,null,null,null,null,null,null,null,null,0,0,"E",null,null,null,null,null,null,null,null,null,0,0,"E",null,null,null,null,null,null,null,null,null,null,null,0,0,"E",null,null,null,null,null,null,null,null,null,null,null,0,0,"E",null,null,null,null,null,null,null,null,null,null,0,0,"E",null,null,null,null,null,null,null,null,0,null,0,"E",null,null,null,null,null,null,null,null,null,0,null,0,"E",null,null,null,null,null,null,null,null,null,0,null,0,"E","---","ERR","","----"]
[null,148,null,null,null,null,null,null,null,null,null,null,null,null,null,null,null,null,null,null,null,null,null,null,null,null,null,null,null,null,null,null,0,0,0,0,0,0,0,0,0,0,0,0,0,null,null,null,null,null,null,null,null,null,null,null,0,0,"E",null,null,null,null,null,null,null,null,null,null,0,0,"E",null,null,null,null,null,null,null,null,null,0,0,"E",null,null,null,null,null,null,null,null,null,null,null,0,0,"E",null,null,null,null,null,null,null,null,null,null,null,0,0,"E",null,null,null,null,null,null,null,null,null,null,0,0,"E",null,null,null,null,null,null,null,null,0,null,0,"E",null,null,null,null,null,null,null,null,null,0,null,0,"E",null,null,null,null,null,null,null,null,null,0,null,0,"E","---","ERR","","----"]
[null,149,null,null,null,null,null,null,null,null,null,null,null,null,null,null,null,null,null,null,null,null,null,null,null,null,null,null,null,null,null,null,0,0,0,0,0,0,0,0,0,0,0,0,0,null,null,null,null,null,null,null,null,null,null,null,0,0,"E",null,null,null,null,null,null,null,null,null,null,0,0,"E",null,null,null,null,null,null,null,null,null,0,0,"E",null,null,null,null,null,null,null,null,null,null,null,0,0,"E",null,null,null,null,null,null,null,null,null,null,null,0,0,"E",null,null,null,null,null,null,null,null,null,null,0,0,"E",null,null,null,null,null,null,null,null,0,null,0,"E",null,null,null,null,null,null,null,null,null,0,null,0,"E",null,null,null,null,null,null,null,null,null,0,null,0,"E","---","ERR","","----"]
[null,150,null,null,null,null,null,null,null,null,null,null,null,null,null,null,null,null,null,null,null,null,null,null,null,null,null,null,null,null,null,null,0,0,0,0,0,0,0,0,0,0,0,0,0,null,null,null,null,null,null,null,null,null,null,null,0,0,"E",null,null,null,null,null,null,null,null,null,null,0,0,"E",null,null,null,null,null,null,null,null,null,0,0,"E",null,null,null,null,null,null,null,null,null,null,null,0,0,"E",null,null,null,null,null,null,null,null,null,null,null,0,0,"E",null,null,null,null,null,null,null,null,null,null,0,0,"E",null,null,null,null,null,null,null,null,0,null,0,"E",null,null,null,null,null,null,null,null,null,0,null,0,"E",null,null,null,null,null,null,null,null,null,0,null,0,"E","---","ERR","","----"]
[null,151,null,null,null,null,null,null,null,null,null,null,null,null,null,null,null,null,null,null,null,null,null,null,null,null,null,null,null,null,null,null,0,0,0,0,0,0,0,0,0,0,0,0,0,null,null,null,null,null,null,null,null,null,null,null,0,0,"E",null,null,null,null,null,null,null,null,null,null,0,0,"E",null,null,null,null,null,null,null,null,null,0,0,"E",null,null,null,null,null,null,null,null,null,null,null,0,0,"E",null,null,null,null,null,null,null,null,null,null,null,0,0,"E",null,null,null,null,null,null,null,null,null,null,0,0,"E",null,null,null,null,null,null,null,null,0,null,0,"E",null,null,null,null,null,null,null,null,null,0,null,0,"E",null,null,null,null,null,null,null,null,null,0,null,0,"E","---","ERR","","----"]
[null,152,null,null,null,null,null,null,null,null,null,null,null,null,null,null,null,null,null,null,null,null,null,null,null,null,null,null,null,null,null,null,0,0,0,0,0,0,0,0,0,0,0,0,0,null,null,null,null,null,null,null,null,null,null,null,0,0,"E",null,null,null,null,null,null,null,null,null,null,0,0,"E",null,null,null,null,null,null,null,null,null,0,0,"E",null,null,null,null,null,null,null,null,null,null,null,0,0,"E",null,null,null,null,null,null,null,null,null,null,null,0,0,"E",null,null,null,null,null,null,null,null,null,null,0,0,"E",null,null,null,null,null,null,null,null,0,null,0,"E",null,null,null,null,null,null,null,null,null,0,null,0,"E",null,null,null,null,null,null,null,null,null,0,null,0,"E","---","ERR","","----"]
[null,153,null,null,null,null,null,null,null,null,null,null,null,null,null,null,null,null,null,null,null,null,null,null,null,null,null,null,null,null,null,null,0,0,0,0,0,0,0,0,0,0,0,0,0,null,null,null,null,null,null,null,null,null,null,null,0,0,"E",null,null,null,null,null,null,null,null,null,null,0,0,"E",null,null,null,null,null,null,null,null,null,0,0,"E",null,null,null,null,null,null,null,null,null,null,null,0,0,"E",null,null,null,null,null,null,null,null,null,null,null,0,0,"E",null,null,null,null,null,null,null,null,null,null,0,0,"E",null,null,null,null,null,null,null,null,0,null,0,"E",null,null,null,null,null,null,null,null,null,0,null,0,"E",null,null,null,null,null,null,null,null,null,0,null,0,"E","---","ERR","","----"]
[null,154,null,null,null,null,null,null,null,null,null,null,null,null,null,null,null,null,null,null,null,null,null,null,null,null,null,null,null,null,null,null,0,0,0,0,0,0,0,0,0,0,0,0,0,null,null,null,null,null,null,null,null,null,null,null,0,0,"E",null,null,null,null,null,null,null,null,null,null,0,0,"E",null,null,null,null,null,null,null,null,null,0,0,"E",null,null,null,null,null,null,null,null,null,null,null,0,0,"E",null,null,null,null,null,null,null,null,null,null,null,0,0,"E",null,null,null,null,null,null,null,null,null,null,0,0,"E",null,null,null,null,null,null,null,null,0,null,0,"E",null,null,null,null,null,null,null,null,null,0,null,0,"E",null,null,null,null,null,null,null,null,null,0,null,0,"E","---","ERR","","----"]
[null,155,null,null,null,null,null,null,null,null,null,null,null,null,null,null,null,null,null,null,null,null,null,null,null,null,null,null,null,null,null,null,0,0,0,0,0,0,0,0,0,0,0,0,0,null,null,null,null,null,null,null,null,null,null,null,0,0,"E",null,null,null,null,null,null,null,null,null,null,0,0,"E",null,null,null,null,null,null,null,null,null,0,0,"E",null,null,null,null,null,null,null,null,null,null,null,0,0,"E",null,null,null,null,null,null,null,null,null,null,null,0,0,"E",null,null,null,null,null,null,null,null,null,null,0,0,"E",null,null,null,null,null,null,null,null,0,null,0,"E",null,null,null,null,null,null,null,null,null,0,null,0,"E",null,null,null,null,null,null,null,null,null,0,null,0,"E","---","ERR","","----"]
[null,156,null,null,null,null,null,null,null,null,null,null,null,null,null,null,null,null,null,null,null,null,null,null,null,null,null,null,null,null,null,null,0,0,0,0,0,0,0,0,0,0,0,0,0,null,null,null,null,null,null,null,null,null,null,null,0,0,"E",null,null,null,null,null,null,null,null,null,null,0,0,"E",null,null,null,null,null,null,null,null,null,0,0,"E",null,null,null,null,null,null,null,null,null,null,null,0,0,"E",null,null,null,null,null,null,null,null,null,null,null,0,0,"E",null,null,null,null,null,null,null,null,null,null,0,0,"E",null,null,null,null,null,null,null,null,0,null,0,"E",null,null,null,null,null,null,null,null,null,0,null,0,"E",null,null,null,null,null,null,null,null,null,0,null,0,"E","---","ERR","","----"]
[null,157,null,null,null,null,null,null,null,null,null,null,null,null,null,null,null,null,null,null,null,null,null,null,null,null,null,null,null,null,null,null,0,0,0,0,0,0,0,0,0,0,0,0,0,null,null,null,null,null,null,null,null,null,null,null,0,0,"E",null,null,null,null,null,null,null,null,null,null,0,0,"E",null,null,null,null,null,null,null,null,null,0,0,"E",null,null,null,null,null,null,null,null,null,null,null,0,0,"E",null,null,null,null,null,null,null,null,null,null,null,0,0,"E",null,null,null,null,null,null,null,null,null,null,0,0,"E",null,null,null,null,null,null,null,null,0,null,0,"E",null,null,null,null,null,null,null,null,null,0,null,0,"E",null,null,null,null,null,null,null,null,null,0,null,0,"E","---","ERR","","----"]
[null,158,null,null,null,null,null,null,null,null,null,null,null,null,null,null,null,null,null,null,null,null,null,null,null,null,null,null,null,null,null,null,0,0,0,0,0,0,0,0,0,0,0,0,0,null,null,null,null,null,null,null,null,null,null,null,0,0,"E",null,null,null,null,null,null,null,null,null,null,0,0,"E",null,null,null,null,null,null,null,null,null,0,0,"E",null,null,null,null,null,null,null,null,null,null,null,0,0,"E",null,null,null,null,null,null,null,null,null,null,null,0,0,"E",null,null,null,null,null,null,null,null,null,null,0,0,"E",null,null,null,null,null,null,null,null,0,null,0,"E",null,null,null,null,null,null,null,null,null,0,null,0,"E",null,null,null,null,null,null,null,null,null,0,null,0,"E","---","ERR","","----"]
[null,159,null,null,null,null,null,null,null,null,null,null,null,null,null,null,null,null,null,null,null,null,null,null,null,null,null,null,null,null,null,null,0,0,0,0,0,0,0,0,0,0,0,0,0,null,null,null,null,null,null,null,null,null,null,null,0,0,"E",null,null,null,null,null,null,null,null,null,null,0,0,"E",null,null,null,null,null,null,null,null,null,0,0,"E",null,null,null,null,null,null,null,null,null,null,null,0,0,"E",null,null,null,null,null,null,null,null,null,null,null,0,0,"E",null,null,null,null,null,null,null,null,null,null,0,0,"E",null,null,null,null,null,null,null,null,0,null,0,"E",null,null,null,null,null,null,null,null,null,0,null,0,"E",null,null,null,null,null,null,null,null,null,0,null,0,"E","---","ERR","","----"]
[null,160,null,null,null,null,null,null,null,null,null,null,null,null,null,null,null,null,null,null,null,null,null,null,null,null,null,null,null,null,null,null,0,0,0,0,0,0,0,0,0,0,0,0,0,null,null,null,null,null,null,null,null,null,null,null,0,0,"E",null,null,null,null,null,null,null,null,null,null,0,0,"E",null,null,null,null,null,null,null,null,null,0,0,"E",null,null,null,null,null,null,null,null,null,null,null,0,0,"E",null,null,null,null,null,null,null,null,null,null,null,0,0,"E",null,null,null,null,null,null,null,null,null,null,0,0,"E",null,null,null,null,null,null,null,null,0,null,0,"E",null,null,null,null,null,null,null,null,null,0,null,0,"E",null,null,null,null,null,null,null,null,null,0,null,0,"E","---","ERR","","----"]
[null,161,null,null,null,null,null,null,null,null,null,null,null,null,null,null,null,null,null,null,null,null,null,null,null,null,null,null,null,null,null,null,0,0,0,0,0,0,0,0,0,0,0,0,0,null,null,null,null,null,null,null,null,null,null,null,0,0,"E",null,null,null,null,null,null,null,null,null,null,0,0,"E",null,null,null,null,null,null,null,null,null,0,0,"E",null,null,null,null,null,null,null,null,null,null,null,0,0,"E",null,null,null,null,null,null,null,null,null,null,null,0,0,"E",null,null,null,null,null,null,null,null,null,null,0,0,"E",null,null,null,null,null,null,null,null,0,null,0,"E",null,null,null,null,null,null,null,null,null,0,null,0,"E",null,null,null,null,null,null,null,null,null,0,null,0,"E","---","ERR","","----"]
[null,162,null,null,null,null,null,null,null,null,null,null,null,null,null,null,null,null,null,null,null,null,null,null,null,null,null,null,null,null,null,null,0,0,0,0,0,0,0,0,0,0,0,0,0,null,null,null,null,null,null,null,null,null,null,null,0,0,"E",null,null,null,null,null,null,null,null,null,null,0,0,"E",null,null,null,null,null,null,null,null,null,0,0,"E",null,null,null,null,null,null,null,null,null,null,null,0,0,"E",null,null,null,null,null,null,null,null,null,null,null,0,0,"E",null,null,null,null,null,null,null,null,null,null,0,0,"E",null,null,null,null,null,null,null,null,0,null,0,"E",null,null,null,null,null,null,null,null,null,0,null,0,"E",null,null,null,null,null,null,null,null,null,0,null,0,"E","---","ERR","","----"]
[null,163,null,null,null,null,null,null,null,null,null,null,null,null,null,null,null,null,null,null,null,null,null,null,null,null,null,null,null,null,null,null,0,0,0,0,0,0,0,0,0,0,0,0,0,null,null,null,null,null,null,null,null,null,null,null,0,0,"E",null,null,null,null,null,null,null,null,null,null,0,0,"E",null,null,null,null,null,null,null,null,null,0,0,"E",null,null,null,null,null,null,null,null,null,null,null,0,0,"E",null,null,null,null,null,null,null,null,null,null,null,0,0,"E",null,null,null,null,null,null,null,null,null,null,0,0,"E",null,null,null,null,null,null,null,null,0,null,0,"E",null,null,null,null,null,null,null,null,null,0,null,0,"E",null,null,null,null,null,null,null,null,null,0,null,0,"E","---","ERR","","----"]
[null,164,null,null,null,null,null,null,null,null,null,null,null,null,null,null,null,null,null,null,null,null,null,null,null,null,null,null,null,null,null,null,0,0,0,0,0,0,0,0,0,0,0,0,0,null,null,null,null,null,null,null,null,null,null,null,0,0,"E",null,null,null,null,null,null,null,null,null,null,0,0,"E",null,null,null,null,null,null,null,null,null,0,0,"E",null,null,null,null,null,null,null,null,null,null,null,0,0,"E",null,null,null,null,null,null,null,null,null,null,null,0,0,"E",null,null,null,null,null,null,null,null,null,null,0,0,"E",null,null,null,null,null,null,null,null,0,null,0,"E",null,null,null,null,null,null,null,null,null,0,null,0,"E",null,null,null,null,null,null,null,null,null,0,null,0,"E","---","ERR","","----"]
[null,165,null,null,null,null,null,null,null,null,null,null,null,null,null,null,null,null,null,null,null,null,null,null,null,null,null,null,null,null,null,null,0,0,0,0,0,0,0,0,0,0,0,0,0,null,null,null,null,null,null,null,null,null,null,null,0,0,"E",null,null,null,null,null,null,null,null,null,null,0,0,"E",null,null,null,null,null,null,null,null,null,0,0,"E",null,null,null,null,null,null,null,null,null,null,null,0,0,"E",null,null,null,null,null,null,null,null,null,null,null,0,0,"E",null,null,null,null,null,null,null,null,null,null,0,0,"E",null,null,null,null,null,null,null,null,0,null,0,"E",null,null,null,null,null,null,null,null,null,0,null,0,"E",null,null,null,null,null,null,null,null,null,0,null,0,"E","---","ERR","","----"]
[null,166,null,null,null,null,null,null,null,null,null,null,null,null,null,null,null,null,null,null,null,null,null,null,null,null,null,null,null,null,null,null,0,0,0,0,0,0,0,0,0,0,0,0,0,null,null,null,null,null,null,null,null,null,null,null,0,0,"E",null,null,null,null,null,null,null,null,null,null,0,0,"E",null,null,null,null,null,null,null,null,null,0,0,"E",null,null,null,null,null,null,null,null,null,null,null,0,0,"E",null,null,null,null,null,null,null,null,null,null,null,0,0,"E",null,null,null,null,null,null,null,null,null,null,0,0,"E",null,null,null,null,null,null,null,null,0,null,0,"E",null,null,null,null,null,null,null,null,null,0,null,0,"E",null,null,null,null,null,null,null,null,null,0,null,0,"E","---","ERR","","----"]
[null,167,null,null,null,null,null,null,null,null,null,null,null,null,null,null,null,null,null,null,null,null,null,null,null,null,null,null,null,null,null,null,0,0,0,0,0,0,0,0,0,0,0,0,0,null,null,null,null,null,null,null,null,null,null,null,0,0,"E",null,null,null,null,null,null,null,null,null,null,0,0,"E",null,null,null,null,null,null,null,null,null,0,0,"E",null,null,null,null,null,null,null,null,null,null,null,0,0,"E",null,null,null,null,null,null,null,null,null,null,null,0,0,"E",null,null,null,null,null,null,null,null,null,null,0,0,"E",null,null,null,null,null,null,null,null,0,null,0,"E",null,null,null,null,null,null,null,null,null,0,null,0,"E",null,null,null,null,null,null,null,null,null,0,null,0,"E","---","ERR","","----"]
[null,168,null,null,null,null,null,null,null,null,null,null,null,null,null,null,null,null,null,null,null,null,null,null,null,null,null,null,null,null,null,null,0,0,0,0,0,0,0,0,0,0,0,0,0,null,null,null,null,null,null,null,null,null,null,null,0,0,"E",null,null,null,null,null,null,null,null,null,null,0,0,"E",null,null,null,null,null,null,null,null,null,0,0,"E",null,null,null,null,null,null,null,null,null,null,null,0,0,"E",null,null,null,null,null,null,null,null,null,null,null,0,0,"E",null,null,null,null,null,null,null,null,null,null,0,0,"E",null,null,null,null,null,null,null,null,0,null,0,"E",null,null,null,null,null,null,null,null,null,0,null,0,"E",null,null,null,null,null,null,null,null,null,0,null,0,"E","---","ERR","","----"]
[null,169,null,null,null,null,null,null,null,null,null,null,null,null,null,null,null,null,null,null,null,null,null,null,null,null,null,null,null,null,null,null,0,0,0,0,0,0,0,0,0,0,0,0,0,null,null,null,null,null,null,null,null,null,null,null,0,0,"E",null,null,null,null,null,null,null,null,null,null,0,0,"E",null,null,null,null,null,null,null,null,null,0,0,"E",null,null,null,null,null,null,null,null,null,null,null,0,0,"E",null,null,null,null,null,null,null,null,null,null,null,0,0,"E",null,null,null,null,null,null,null,null,null,null,0,0,"E",null,null,null,null,null,null,null,null,0,null,0,"E",null,null,null,null,null,null,null,null,null,0,null,0,"E",null,null,null,null,null,null,null,null,null,0,null,0,"E","---","ERR","","----"]
[null,170,null,null,null,null,null,null,null,null,null,null,null,null,null,null,null,null,null,null,null,null,null,null,null,null,null,null,null,null,null,null,0,0,0,0,0,0,0,0,0,0,0,0,0,null,null,null,null,null,null,null,null,null,null,null,0,0,"E",null,null,null,null,null,null,null,null,null,null,0,0,"E",null,null,null,null,null,null,null,null,null,0,0,"E",null,null,null,null,null,null,null,null,null,null,null,0,0,"E",null,null,null,null,null,null,null,null,null,null,null,0,0,"E",null,null,null,null,null,null,null,null,null,null,0,0,"E",null,null,null,null,null,null,null,null,0,null,0,"E",null,null,null,null,null,null,null,null,null,0,null,0,"E",null,null,null,null,null,null,null,null,null,0,null,0,"E","---","ERR","","----"]
[null,171,null,null,null,null,null,null,null,null,null,null,null,null,null,null,null,null,null,null,null,null,null,null,null,null,null,null,null,null,null,null,0,0,0,0,0,0,0,0,0,0,0,0,0,null,null,null,null,null,null,null,null,null,null,null,0,0,"E",null,null,null,null,null,null,null,null,null,null,0,0,"E",null,null,null,null,null,null,null,null,null,0,0,"E",null,null,null,null,null,null,null,null,null,null,null,0,0,"E",null,null,null,null,null,null,null,null,null,null,null,0,0,"E",null,null,null,null,null,null,null,null,null,null,0,0,"E",null,null,null,null,null,null,null,null,0,null,0,"E",null,null,null,null,null,null,null,null,null,0,null,0,"E",null,null,null,null,null,null,null,null,null,0,null,0,"E","---","ERR","","----"]
[null,172,null,null,null,null,null,null,null,null,null,null,null,null,null,null,null,null,null,null,null,null,null,null,null,null,null,null,null,null,null,null,0,0,0,0,0,0,0,0,0,0,0,0,0,null,null,null,null,null,null,null,null,null,null,null,0,0,"E",null,null,null,null,null,null,null,null,null,null,0,0,"E",null,null,null,null,null,null,null,null,null,0,0,"E",null,null,null,null,null,null,null,null,null,null,null,0,0,"E",null,null,null,null,null,null,null,null,null,null,null,0,0,"E",null,null,null,null,null,null,null,null,null,null,0,0,"E",null,null,null,null,null,null,null,null,0,null,0,"E",null,null,null,null,null,null,null,null,null,0,null,0,"E",null,null,null,null,null,null,null,null,null,0,null,0,"E","---","ERR","","----"]
[null,173,null,null,null,null,null,null,null,null,null,null,null,null,null,null,null,null,null,null,null,null,null,null,null,null,null,null,null,null,null,null,0,0,0,0,0,0,0,0,0,0,0,0,0,null,null,null,null,null,null,null,null,null,null,null,0,0,"E",null,null,null,null,null,null,null,null,null,null,0,0,"E",null,null,null,null,null,null,null,null,null,0,0,"E",null,null,null,null,null,null,null,null,null,null,null,0,0,"E",null,null,null,null,null,null,null,null,null,null,null,0,0,"E",null,null,null,null,null,null,null,null,null,null,0,0,"E",null,null,null,null,null,null,null,null,0,null,0,"E",null,null,null,null,null,null,null,null,null,0,null,0,"E",null,null,null,null,null,null,null,null,null,0,null,0,"E","---","ERR","","----"]
[null,174,null,null,null,null,null,null,null,null,null,null,null,null,null,null,null,null,null,null,null,null,null,null,null,null,null,null,null,null,null,null,0,0,0,0,0,0,0,0,0,0,0,0,0,null,null,null,null,null,null,null,null,null,null,null,0,0,"E",null,null,null,null,null,null,null,null,null,null,0,0,"E",null,null,null,null,null,null,null,null,null,0,0,"E",null,null,null,null,null,null,null,null,null,null,null,0,0,"E",null,null,null,null,null,null,null,null,null,null,null,0,0,"E",null,null,null,null,null,null,null,null,null,null,0,0,"E",null,null,null,null,null,null,null,null,0,null,0,"E",null,null,null,null,null,null,null,null,null,0,null,0,"E",null,null,null,null,null,null,null,null,null,0,null,0,"E","---","ERR","","----"]
[null,175,null,null,null,null,null,null,null,null,null,null,null,null,null,null,null,null,null,null,null,null,null,null,null,null,null,null,null,null,null,null,0,0,0,0,0,0,0,0,0,0,0,0,0,null,null,null,null,null,null,null,null,null,null,null,0,0,"E",null,null,null,null,null,null,null,null,null,null,0,0,"E",null,null,null,null,null,null,null,null,null,0,0,"E",null,null,null,null,null,null,null,null,null,null,null,0,0,"E",null,null,null,null,null,null,null,null,null,null,null,0,0,"E",null,null,null,null,null,null,null,null,null,null,0,0,"E",null,null,null,null,null,null,null,null,0,null,0,"E",null,null,null,null,null,null,null,null,null,0,null,0,"E",null,null,null,null,null,null,null,null,null,0,null,0,"E","---","ERR","","----"]
[null,176,null,null,null,null,null,null,null,null,null,null,null,null,null,null,null,null,null,null,null,null,null,null,null,null,null,null,null,null,null,null,0,0,0,0,0,0,0,0,0,0,0,0,0,null,null,null,null,null,null,null,null,null,null,null,0,0,"E",null,null,null,null,null,null,null,null,null,null,0,0,"E",null,null,null,null,null,null,null,null,null,0,0,"E",null,null,null,null,null,null,null,null,null,null,null,0,0,"E",null,null,null,null,null,null,null,null,null,null,null,0,0,"E",null,null,null,null,null,null,null,null,null,null,0,0,"E",null,null,null,null,null,null,null,null,0,null,0,"E",null,null,null,null,null,null,null,null,null,0,null,0,"E",null,null,null,null,null,null,null,null,null,0,null,0,"E","---","ERR","","----"]
[null,177,null,null,null,null,null,null,null,null,null,null,null,null,null,null,null,null,null,null,null,null,null,null,null,null,null,null,null,null,null,null,0,0,0,0,0,0,0,0,0,0,0,0,0,null,null,null,null,null,null,null,null,null,null,null,0,0,"E",null,null,null,null,null,null,null,null,null,null,0,0,"E",null,null,null,null,null,null,null,null,null,0,0,"E",null,null,null,null,null,null,null,null,null,null,null,0,0,"E",null,null,null,null,null,null,null,null,null,null,null,0,0,"E",null,null,null,null,null,null,null,null,null,null,0,0,"E",null,null,null,null,null,null,null,null,0,null,0,"E",null,null,null,null,null,null,null,null,null,0,null,0,"E",null,null,null,null,null,null,null,null,null,0,null,0,"E","---","ERR","","----"]
[null,178,null,null,null,null,null,null,null,null,null,null,null,null,null,null,null,null,null,null,null,null,null,null,null,null,null,null,null,null,null,null,0,0,0,0,0,0,0,0,0,0,0,0,0,null,null,null,null,null,null,null,null,null,null,null,0,0,"E",null,null,null,null,null,null,null,null,null,null,0,0,"E",null,null,null,null,null,null,null,null,null,0,0,"E",null,null,null,null,null,null,null,null,null,null,null,0,0,"E",null,null,null,null,null,null,null,null,null,null,null,0,0,"E",null,null,null,null,null,null,null,null,null,null,0,0,"E",null,null,null,null,null,null,null,null,0,null,0,"E",null,null,null,null,null,null,null,null,null,0,null,0,"E",null,null,null,null,null,null,null,null,null,0,null,0,"E","---","ERR","","----"]
[null,179,null,null,null,null,null,null,null,null,null,null,null,null,null,null,null,null,null,null,null,null,null,null,null,null,null,null,null,null,null,null,0,0,0,0,0,0,0,0,0,0,0,0,0,null,null,null,null,null,null,null,null,null,null,null,0,0,"E",null,null,null,null,null,null,null,null,null,null,0,0,"E",null,null,null,null,null,null,null,null,null,0,0,"E",null,null,null,null,null,null,null,null,null,null,null,0,0,"E",null,null,null,null,null,null,null,null,null,null,null,0,0,"E",null,null,null,null,null,null,null,null,null,null,0,0,"E",null,null,null,null,null,null,null,null,0,null,0,"E",null,null,null,null,null,null,null,null,null,0,null,0,"E",null,null,null,null,null,null,null,null,null,0,null,0,"E","---","ERR","","----"]
[null,180,null,null,null,null,null,null,null,null,null,null,null,null,null,null,null,null,null,null,null,null,null,null,null,null,null,null,null,null,null,null,0,0,0,0,0,0,0,0,0,0,0,0,0,null,null,null,null,null,null,null,null,null,null,null,0,0,"E",null,null,null,null,null,null,null,null,null,null,0,0,"E",null,null,null,null,null,null,null,null,null,0,0,"E",null,null,null,null,null,null,null,null,null,null,null,0,0,"E",null,null,null,null,null,null,null,null,null,null,null,0,0,"E",null,null,null,null,null,null,null,null,null,null,0,0,"E",null,null,null,null,null,null,null,null,0,null,0,"E",null,null,null,null,null,null,null,null,null,0,null,0,"E",null,null,null,null,null,null,null,null,null,0,null,0,"E","---","ERR","","----"]
[null,181,null,null,null,null,null,null,null,null,null,null,null,null,null,null,null,null,null,null,null,null,null,null,null,null,null,null,null,null,null,null,0,0,0,0,0,0,0,0,0,0,0,0,0,null,null,null,null,null,null,null,null,null,null,null,0,0,"E",null,null,null,null,null,null,null,null,null,null,0,0,"E",null,null,null,null,null,null,null,null,null,0,0,"E",null,null,null,null,null,null,null,null,null,null,null,0,0,"E",null,null,null,null,null,null,null,null,null,null,null,0,0,"E",null,null,null,null,null,null,null,null,null,null,0,0,"E",null,null,null,null,null,null,null,null,0,null,0,"E",null,null,null,null,null,null,null,null,null,0,null,0,"E",null,null,null,null,null,null,null,null,null,0,null,0,"E","---","ERR","","----"]
[null,182,null,null,null,null,null,null,null,null,null,null,null,null,null,null,null,null,null,null,null,null,null,null,null,null,null,null,null,null,null,null,0,0,0,0,0,0,0,0,0,0,0,0,0,null,null,null,null,null,null,null,null,null,null,null,0,0,"E",null,null,null,null,null,null,null,null,null,null,0,0,"E",null,null,null,null,null,null,null,null,null,0,0,"E",null,null,null,null,null,null,null,null,null,null,null,0,0,"E",null,null,null,null,null,null,null,null,null,null,null,0,0,"E",null,null,null,null,null,null,null,null,null,null,0,0,"E",null,null,null,null,null,null,null,null,0,null,0,"E",null,null,null,null,null,null,null,null,null,0,null,0,"E",null,null,null,null,null,null,null,null,null,0,null,0,"E","---","ERR","","----"]
[null,183,null,null,null,null,null,null,null,null,null,null,null,null,null,null,null,null,null,null,null,null,null,null,null,null,null,null,null,null,null,null,0,0,0,0,0,0,0,0,0,0,0,0,0,null,null,null,null,null,null,null,null,null,null,null,0,0,"E",null,null,null,null,null,null,null,null,null,null,0,0,"E",null,null,null,null,null,null,null,null,null,0,0,"E",null,null,null,null,null,null,null,null,null,null,null,0,0,"E",null,null,null,null,null,null,null,null,null,null,null,0,0,"E",null,null,null,null,null,null,null,null,null,null,0,0,"E",null,null,null,null,null,null,null,null,0,null,0,"E",null,null,null,null,null,null,null,null,null,0,null,0,"E",null,null,null,null,null,null,null,null,null,0,null,0,"E","---","ERR","","----"]
[null,184,null,null,null,null,null,null,null,null,null,null,null,null,null,null,null,null,null,null,null,null,null,null,null,null,null,null,null,null,null,null,0,0,0,0,0,0,0,0,0,0,0,0,0,null,null,null,null,null,null,null,null,null,null,null,0,0,"E",null,null,null,null,null,null,null,null,null,null,0,0,"E",null,null,null,null,null,null,null,null,null,0,0,"E",null,null,null,null,null,null,null,null,null,null,null,0,0,"E",null,null,null,null,null,null,null,null,null,null,null,0,0,"E",null,null,null,null,null,null,null,null,null,null,0,0,"E",null,null,null,null,null,null,null,null,0,null,0,"E",null,null,null,null,null,null,null,null,null,0,null,0,"E",null,null,null,null,null,null,null,null,null,0,null,0,"E","---","ERR","","----"]
[null,185,null,null,null,null,null,null,null,null,null,null,null,null,null,null,null,null,null,null,null,null,null,null,null,null,null,null,null,null,null,null,0,0,0,0,0,0,0,0,0,0,0,0,0,null,null,null,null,null,null,null,null,null,null,null,0,0,"E",null,null,null,null,null,null,null,null,null,null,0,0,"E",null,null,null,null,null,null,null,null,null,0,0,"E",null,null,null,null,null,null,null,null,null,null,null,0,0,"E",null,null,null,null,null,null,null,null,null,null,null,0,0,"E",null,null,null,null,null,null,null,null,null,null,0,0,"E",null,null,null,null,null,null,null,null,0,null,0,"E",null,null,null,null,null,null,null,null,null,0,null,0,"E",null,null,null,null,null,null,null,null,null,0,null,0,"E","---","ERR","","----"]
[null,186,null,null,null,null,null,null,null,null,null,null,null,null,null,null,null,null,null,null,null,null,null,null,null,null,null,null,null,null,null,null,0,0,0,0,0,0,0,0,0,0,0,0,0,null,null,null,null,null,null,null,null,null,null,null,0,0,"E",null,null,null,null,null,null,null,null,null,null,0,0,"E",null,null,null,null,null,null,null,null,null,0,0,"E",null,null,null,null,null,null,null,null,null,null,null,0,0,"E",null,null,null,null,null,null,null,null,null,null,null,0,0,"E",null,null,null,null,null,null,null,null,null,null,0,0,"E",null,null,null,null,null,null,null,null,0,null,0,"E",null,null,null,null,null,null,null,null,null,0,null,0,"E",null,null,null,null,null,null,null,null,null,0,null,0,"E","---","ERR","","----"]
[null,187,null,null,null,null,null,null,null,null,null,null,null,null,null,null,null,null,null,null,null,null,null,null,null,null,null,null,null,null,null,null,0,0,0,0,0,0,0,0,0,0,0,0,0,null,null,null,null,null,null,null,null,null,null,null,0,0,"E",null,null,null,null,null,null,null,null,null,null,0,0,"E",null,null,null,null,null,null,null,null,null,0,0,"E",null,null,null,null,null,null,null,null,null,null,null,0,0,"E",null,null,null,null,null,null,null,null,null,null,null,0,0,"E",null,null,null,null,null,null,null,null,null,null,0,0,"E",null,null,null,null,null,null,null,null,0,null,0,"E",null,null,null,null,null,null,null,null,null,0,null,0,"E",null,null,null,null,null,null,null,null,null,0,null,0,"E","---","ERR","","----"]
[null,188,null,null,null,null,null,null,null,null,null,null,null,null,null,null,null,null,null,null,null,null,null,null,null,null,null,null,null,null,null,null,0,0,0,0,0,0,0,0,0,0,0,0,0,null,null,null,null,null,null,null,null,null,null,null,0,0,"E",null,null,null,null,null,null,null,null,null,null,0,0,"E",null,null,null,null,null,null,null,null,null,0,0,"E",null,null,null,null,null,null,null,null,null,null,null,0,0,"E",null,null,null,null,null,null,null,null,null,null,null,0,0,"E",null,null,null,null,null,null,null,null,null,null,0,0,"E",null,null,null,null,null,null,null,null,0,null,0,"E",null,null,null,null,null,null,null,null,null,0,null,0,"E",null,null,null,null,null,null,null,null,null,0,null,0,"E","---","ERR","","----"]
[null,189,null,null,null,null,null,null,null,null,null,null,null,null,null,null,null,null,null,null,null,null,null,null,null,null,null,null,null,null,null,null,0,0,0,0,0,0,0,0,0,0,0,0,0,null,null,null,null,null,null,null,null,null,null,null,0,0,"E",null,null,null,null,null,null,null,null,null,null,0,0,"E",null,null,null,null,null,null,null,null,null,0,0,"E",null,null,null,null,null,null,null,null,null,null,null,0,0,"E",null,null,null,null,null,null,null,null,null,null,null,0,0,"E",null,null,null,null,null,null,null,null,null,null,0,0,"E",null,null,null,null,null,null,null,null,0,null,0,"E",null,null,null,null,null,null,null,null,null,0,null,0,"E",null,null,null,null,null,null,null,null,null,0,null,0,"E","---","ERR","","----"]
[null,190,null,null,null,null,null,null,null,null,null,null,null,null,null,null,null,null,null,null,null,null,null,null,null,null,null,null,null,null,null,null,0,0,0,0,0,0,0,0,0,0,0,0,0,null,null,null,null,null,null,null,null,null,null,null,0,0,"E",null,null,null,null,null,null,null,null,null,null,0,0,"E",null,null,null,null,null,null,null,null,null,0,0,"E",null,null,null,null,null,null,null,null,null,null,null,0,0,"E",null,null,null,null,null,null,null,null,null,null,null,0,0,"E",null,null,null,null,null,null,null,null,null,null,0,0,"E",null,null,null,null,null,null,null,null,0,null,0,"E",null,null,null,null,null,null,null,null,null,0,null,0,"E",null,null,null,null,null,null,null,null,null,0,null,0,"E","---","ERR","","----"]
[null,191,null,null,null,null,null,null,null,null,null,null,null,null,null,null,null,null,null,null,null,null,null,null,null,null,null,null,null,null,null,null,0,0,0,0,0,0,0,0,0,0,0,0,0,null,null,null,null,null,null,null,null,null,null,null,0,0,"E",null,null,null,null,null,null,null,null,null,null,0,0,"E",null,null,null,null,null,null,null,null,null,0,0,"E",null,null,null,null,null,null,null,null,null,null,null,0,0,"E",null,null,null,null,null,null,null,null,null,null,null,0,0,"E",null,null,null,null,null,null,null,null,null,null,0,0,"E",null,null,null,null,null,null,null,null,0,null,0,"E",null,null,null,null,null,null,null,null,null,0,null,0,"E",null,null,null,null,null,null,null,null,null,0,null,0,"E","---","ERR","","----"]
[null,192,null,null,null,null,null,null,null,null,null,null,null,null,null,null,null,null,null,null,null,null,null,null,null,null,null,null,null,null,null,null,0,0,0,0,0,0,0,0,0,0,0,0,0,null,null,null,null,null,null,null,null,null,null,null,0,0,"E",null,null,null,null,null,null,null,null,null,null,0,0,"E",null,null,null,null,null,null,null,null,null,0,0,"E",null,null,null,null,null,null,null,null,null,null,null,0,0,"E",null,null,null,null,null,null,null,null,null,null,null,0,0,"E",null,null,null,null,null,null,null,null,null,null,0,0,"E",null,null,null,null,null,null,null,null,0,null,0,"E",null,null,null,null,null,null,null,null,null,0,null,0,"E",null,null,null,null,null,null,null,null,null,0,null,0,"E","---","ERR","","----"]
[null,193,null,null,null,null,null,null,null,null,null,null,null,null,null,null,null,null,null,null,null,null,null,null,null,null,null,null,null,null,null,null,0,0,0,0,0,0,0,0,0,0,0,0,0,null,null,null,null,null,null,null,null,null,null,null,0,0,"E",null,null,null,null,null,null,null,null,null,null,0,0,"E",null,null,null,null,null,null,null,null,null,0,0,"E",null,null,null,null,null,null,null,null,null,null,null,0,0,"E",null,null,null,null,null,null,null,null,null,null,null,0,0,"E",null,null,null,null,null,null,null,null,null,null,0,0,"E",null,null,null,null,null,null,null,null,0,null,0,"E",null,null,null,null,null,null,null,null,null,0,null,0,"E",null,null,null,null,null,null,null,null,null,0,null,0,"E","---","ERR","","----"]
[null,194,null,null,null,null,null,null,null,null,null,null,null,null,null,null,null,null,null,null,null,null,null,null,null,null,null,null,null,null,null,null,{"$f":"SUM(V200:AF200)","v":0},{"$f":"V200/$V$4","v":0},{"$f":"W200/$W$4","v":0},{"$f":"X200/$X$4","v":0},{"$f":"Y200/$Y$4","v":0},{"$f":"Z200/$Z$4","v":0},{"$f":"AA200/$AA$4","v":0},{"$f":"AB200/$AB$4","v":0},{"$f":"AC200/$AC$4","v":0},{"$f":"AD200/$AD$4","v":0},{"$f":"AE200/$AE$4","v":0},{"$f":"AF200/$AF$4","v":0},{"$f":"AG200/$AG$4","v":0},null,null,null,null,null,null,null,null,null,null,null,{"$f":"SUM(AZ200:BD200)","v":0},{"$f":"BE200+AY200","v":0},{"$f":"IFERROR(IF(BF200>90,\"A+\",IF(BF200>80,\"A\",IF(BF200>70,\"B+\",IF(BF200>60,\"B\",IF(BF200>50,\"C+\",IF(BF200>40,\"C\",IF(BF200>=33,\"D\",\"E\"))))))),\"Abs\")","v":"E"},null,null,null,null,null,null,null,null,null,null,{"$f":"SUM(BM200:BQ200)","v":0},{"$f":"BR200+BL200","v":0},{"$f":"IFERROR(IF(BS200>90,\"A+\",IF(BS200>80,\"A\",IF(BS200>70,\"B+\",IF(BS200>60,\"B\",IF(BS200>50,\"C+\",IF(BS200>40,\"C\",IF(BS200>=33,\"D\",\"E\"))))))),\"Abs\")","v":"E"},null,null,null,null,null,null,null,null,null,{"$f":"SUM(BZ200:CC200)","v":0},{"$f":"CD200+BY200","v":0},{"$f":"IFERROR(IF(CE200>90,\"A+\",IF(CE200>80,\"A\",IF(CE200>70,\"B+\",IF(CE200>60,\"B\",IF(CE200>50,\"C+\",IF(CE200>40,\"C\",IF(CE200>=33,\"D\",\"E\"))))))),\"Abs\")","v":"E"},null,null,null,null,null,null,null,null,null,null,null,{"$f":"SUM(CL200:CQ200)","v":0},{"$f":"CR200+CK200","v":0},{"$f":"IFERROR(IF(CS200>90,\"A+\",IF(CS200>80,\"A\",IF(CS200>70,\"B+\",IF(CS200>60,\"B\",IF(CS200>50,\"C+\",IF(CS200>40,\"C\",IF(CS200>=33,\"D\",\"E\"))))))),\"Abs\")","v":"E"},null,null,null,null,null,null,null,null,null,null,null,{"$f":"SUM(CZ200:DE200)","v":0},{"$f":"DF200+CY200","v":0},{"$f":"IFERROR(IF(DG200>90,\"A+\",IF(DG200>80,\"A\",IF(DG200>70,\"B+\",IF(DG200>60,\"B\",IF(DG200>50,\"C+\",IF(DG200>40,\"C\",IF(DG200>=33,\"D\",\"E\"))))))),\"Abs\")","v":"E"},null,null,null,null,null,null,null,null,null,null,{"$f":"SUM(DN200:DR200)","v":0},{"$f":"DS200+DM200","v":0},{"$f":"IFERROR(IF(DT200>90,\"A+\",IF(DT200>80,\"A\",IF(DT200>70,\"B+\",IF(DT200>60,\"B\",IF(DT200>50,\"C+\",IF(DT200>40,\"C\",IF(DT200>=33,\"D\",\"E\"))))))),\"Abs\")","v":"E"},null,null,null,null,null,null,null,null,{"$f":"SUM(EA200:EC200)","v":0},null,{"$f":"EE200+ED200+DZ200","v":0},{"$f":"IFERROR(IF(EF200>90,\"A+\",IF(EF200>80,\"A\",IF(EF200>70,\"B+\",IF(EF200>60,\"B\",IF(EF200>50,\"C+\",IF(EF200>40,\"C\",IF(EF200>=33,\"D\",\"E\"))))))),\"Abs\")","v":"E"},null,null,null,null,null,null,null,null,null,{"$f":"SUM(EM200:EP200)","v":0},null,{"$f":"ER200+EQ200+EL200","v":0},{"$f":"IFERROR(IF(ES200>90,\"A+\",IF(ES200>80,\"A\",IF(ES200>70,\"B+\",IF(ES200>60,\"B\",IF(ES200>50,\"C+\",IF(ES200>40,\"C\",IF(ES200>=33,\"D\",\"E\"))))))),\"Abs\")","v":"E"},null,null,null,null,null,null,null,null,null,{"$f":"SUM(EZ200:FC200)","v":0},null,{"$f":"FE200+FD200+EY200","v":0},{"$f":"IFERROR(IF(FF200>90,\"A+\",IF(FF200>80,\"A\",IF(FF200>70,\"B+\",IF(FF200>60,\"B\",IF(FF200>50,\"C+\",IF(FF200>40,\"C\",IF(FF200>=33,\"D\",\"E\"))))))),\"Abs\")","v":"E"},{"$f":"IF(AND(MIN(AY200,BL200,BY200,CK200,CY200,DM200)>19,MIN(BF200,BS200,CE200,CS200,DG200,DT200)>32),SUM(BF200,BS200,CE200,CS200,DG200,DT200),\"---\")","v":"---"},{"$f":"IFERROR(FH200/600*100,\"ERR\")","v":"ERR"},{"$f":"IF(FI200=\"ERR\",\"\",(IF(FI200>90,\"A+\",IF(FI200>80,\"A\",IF(FI200>70,\"B+\",IF(FI200>60,\"B\",IF(FI200>50,\"C+\",IF(FI200>40,\"C\",IF(FI200>=33,\"D\",IF(FI200<33,\"E\",\"\"))))))))))","v":""},{"$f":"IF(FI200=\"ERR\",\"----\",IF(FI200>=33,\"ਪਾਸ\",\"--\"))","v":"----"}]
[null,195,null,null,null,null,null,null,null,null,null,null,null,null,null,null,null,null,null,null,null,null,null,null,null,null,null,null,null,null,null,null,0,0,0,0,0,0,0,0,0,0,0,0,0,null,null,null,null,null,null,null,null,null,null,null,0,0,"E",null,null,null,null,null,null,null,null,null,null,0,0,"E",null,null,null,null,null,null,null,null,null,0,0,"E",null,null,null,null,null,null,null,null,null,null,null,0,0,"E",null,null,null,null,null,null,null,null,null,null,null,0,0,"E",null,null,null,null,null,null,null,null,null,null,0,0,"E",null,null,null,null,null,null,null,null,0,null,0,"E",null,null,null,null,null,null,null,null,null,0,null,0,"E",null,null,null,null,null,null,null,null,null,0,null,0,"E","---","ERR","","----"]
[null,196,null,null,null,null,null,null,null,null,null,null,null,null,null,null,null,null,null,null,null,null,null,null,null,null,null,null,null,null,null,null,0,0,0,0,0,0,0,0,0,0,0,0,0,null,null,null,null,null,null,null,null,null,null,null,0,0,"E",null,null,null,null,null,null,null,null,null,null,0,0,"E",null,null,null,null,null,null,null,null,null,0,0,"E",null,null,null,null,null,null,null,null,null,null,null,0,0,"E",null,null,null,null,null,null,null,null,null,null,null,0,0,"E",null,null,null,null,null,null,null,null,null,null,0,0,"E",null,null,null,null,null,null,null,null,0,null,0,"E",null,null,null,null,null,null,null,null,null,0,null,0,"E",null,null,null,null,null,null,null,null,null,0,null,0,"E","---","ERR","","----"]
[null,197,null,null,null,null,null,null,null,null,null,null,null,null,null,null,null,null,null,null,null,null,null,null,null,null,null,null,null,null,null,null,0,0,0,0,0,0,0,0,0,0,0,0,0,null,null,null,null,null,null,null,null,null,null,null,0,0,"E",null,null,null,null,null,null,null,null,null,null,0,0,"E",null,null,null,null,null,null,null,null,null,0,0,"E",null,null,null,null,null,null,null,null,null,null,null,0,0,"E",null,null,null,null,null,null,null,null,null,null,null,0,0,"E",null,null,null,null,null,null,null,null,null,null,0,0,"E",null,null,null,null,null,null,null,null,0,null,0,"E",null,null,null,null,null,null,null,null,null,0,null,0,"E",null,null,null,null,null,null,null,null,null,0,null,0,"E","---","ERR","","----"]
[null,198,null,null,null,null,null,null,null,null,null,null,null,null,null,null,null,null,null,null,null,null,null,null,null,null,null,null,null,null,null,null,0,0,0,0,0,0,0,0,0,0,0,0,0,null,null,null,null,null,null,null,null,null,null,null,0,0,"E",null,null,null,null,null,null,null,null,null,null,0,0,"E",null,null,null,null,null,null,null,null,null,0,0,"E",null,null,null,null,null,null,null,null,null,null,null,0,0,"E",null,null,null,null,null,null,null,null,null,null,null,0,0,"E",null,null,null,null,null,null,null,null,null,null,0,0,"E",null,null,null,null,null,null,null,null,0,null,0,"E",null,null,null,null,null,null,null,null,null,0,null,0,"E",null,null,null,null,null,null,null,null,null,0,null,0,"E","---","ERR","","----"]
[null,199,null,null,null,null,null,null,null,null,null,null,null,null,null,null,null,null,null,null,null,null,null,null,null,null,null,null,null,null,null,null,0,0,0,0,0,0,0,0,0,0,0,0,0,null,null,null,null,null,null,null,null,null,null,null,0,0,"E",null,null,null,null,null,null,null,null,null,null,0,0,"E",null,null,null,null,null,null,null,null,null,0,0,"E",null,null,null,null,null,null,null,null,null,null,null,0,0,"E",null,null,null,null,null,null,null,null,null,null,null,0,0,"E",null,null,null,null,null,null,null,null,null,null,0,0,"E",null,null,null,null,null,null,null,null,0,null,0,"E",null,null,null,null,null,null,null,null,null,0,null,0,"E",null,null,null,null,null,null,null,null,null,0,null,0,"E","---","ERR","","----"]
[null,200,null,null,null,null,null,null,null,null,null,null,null,null,null,null,null,null,null,null,null,null,null,null,null,null,null,null,null,null,null,null,0,0,0,0,0,0,0,0,0,0,0,0,0,null,null,null,null,null,null,null,null,null,null,null,0,0,"E",null,null,null,null,null,null,null,null,null,null,0,0,"E",null,null,null,null,null,null,null,null,null,0,0,"E",null,null,null,null,null,null,null,null,null,null,null,0,0,"E",null,null,null,null,null,null,null,null,null,null,null,0,0,"E",null,null,null,null,null,null,null,null,null,null,0,0,"E",null,null,null,null,null,null,null,null,0,null,0,"E",null,null,null,null,null,null,null,null,null,0,null,0,"E",null,null,null,null,null,null,null,null,null,0,null,0,"E","---","ERR","","----"]
[null,201,null,null,null,null,null,null,null,null,null,null,null,null,null,null,null,null,null,null,null,null,null,null,null,null,null,null,null,null,null,null,0,0,0,0,0,0,0,0,0,0,0,0,0,null,null,null,null,null,null,null,null,null,null,null,0,0,"E",null,null,null,null,null,null,null,null,null,null,0,0,"E",null,null,null,null,null,null,null,null,null,0,0,"E",null,null,null,null,null,null,null,null,null,null,null,0,0,"E",null,null,null,null,null,null,null,null,null,null,null,0,0,"E",null,null,null,null,null,null,null,null,null,null,0,0,"E",null,null,null,null,null,null,null,null,0,null,0,"E",null,null,null,null,null,null,null,null,null,0,null,0,"E",null,null,null,null,null,null,null,null,null,0,null,0,"E","---","ERR","","----"]
[null,202,null,null,null,null,null,null,null,null,null,null,null,null,null,null,null,null,null,null,null,null,null,null,null,null,null,null,null,null,null,null,0,0,0,0,0,0,0,0,0,0,0,0,0,null,null,null,null,null,null,null,null,null,null,null,0,0,"E",null,null,null,null,null,null,null,null,null,null,0,0,"E",null,null,null,null,null,null,null,null,null,0,0,"E",null,null,null,null,null,null,null,null,null,null,null,0,0,"E",null,null,null,null,null,null,null,null,null,null,null,0,0,"E",null,null,null,null,null,null,null,null,null,null,0,0,"E",null,null,null,null,null,null,null,null,0,null,0,"E",null,null,null,null,null,null,null,null,null,0,null,0,"E",null,null,null,null,null,null,null,null,null,0,null,0,"E","---","ERR","","----"]
[null,203,null,null,null,null,null,null,null,null,null,null,null,null,null,null,null,null,null,null,null,null,null,null,null,null,null,null,null,null,null,null,0,0,0,0,0,0,0,0,0,0,0,0,0,null,null,null,null,null,null,null,null,null,null,null,0,0,"E",null,null,null,null,null,null,null,null,null,null,0,0,"E",null,null,null,null,null,null,null,null,null,0,0,"E",null,null,null,null,null,null,null,null,null,null,null,0,0,"E",null,null,null,null,null,null,null,null,null,null,null,0,0,"E",null,null,null,null,null,null,null,null,null,null,0,0,"E",null,null,null,null,null,null,null,null,0,null,0,"E",null,null,null,null,null,null,null,null,null,0,null,0,"E",null,null,null,null,null,null,null,null,null,0,null,0,"E","---","ERR","","----"]
[null,204,null,null,null,null,null,null,null,null,null,null,null,null,null,null,null,null,null,null,null,null,null,null,null,null,null,null,null,null,null,null,0,0,0,0,0,0,0,0,0,0,0,0,0,null,null,null,null,null,null,null,null,null,null,null,0,0,"E",null,null,null,null,null,null,null,null,null,null,0,0,"E",null,null,null,null,null,null,null,null,null,0,0,"E",null,null,null,null,null,null,null,null,null,null,null,0,0,"E",null,null,null,null,null,null,null,null,null,null,null,0,0,"E",null,null,null,null,null,null,null,null,null,null,0,0,"E",null,null,null,null,null,null,null,null,0,null,0,"E",null,null,null,null,null,null,null,null,null,0,null,0,"E",null,null,null,null,null,null,null,null,null,0,null,0,"E","---","ERR","","----"]
[null,205,null,null,null,null,null,null,null,null,null,null,null,null,null,null,null,null,null,null,null,null,null,null,null,null,null,null,null,null,null,null,0,0,0,0,0,0,0,0,0,0,0,0,0,null,null,null,null,null,null,null,null,null,null,null,0,0,"E",null,null,null,null,null,null,null,null,null,null,0,0,"E",null,null,null,null,null,null,null,null,null,0,0,"E",null,null,null,null,null,null,null,null,null,null,null,0,0,"E",null,null,null,null,null,null,null,null,null,null,null,0,0,"E",null,null,null,null,null,null,null,null,null,null,0,0,"E",null,null,null,null,null,null,null,null,0,null,0,"E",null,null,null,null,null,null,null,null,null,0,null,0,"E",null,null,null,null,null,null,null,null,null,0,null,0,"E","---","ERR","","----"]
[null,206,null,null,null,null,null,null,null,null,null,null,null,null,null,null,null,null,null,null,null,null,null,null,null,null,null,null,null,null,null,null,0,0,0,0,0,0,0,0,0,0,0,0,0,null,null,null,null,null,null,null,null,null,null,null,0,0,"E",null,null,null,null,null,null,null,null,null,null,0,0,"E",null,null,null,null,null,null,null,null,null,0,0,"E",null,null,null,null,null,null,null,null,null,null,null,0,0,"E",null,null,null,null,null,null,null,null,null,null,null,0,0,"E",null,null,null,null,null,null,null,null,null,null,0,0,"E",null,null,null,null,null,null,null,null,0,null,0,"E",null,null,null,null,null,null,null,null,null,0,null,0,"E",null,null,null,null,null,null,null,null,null,0,null,0,"E","---","ERR","","----"]
[null,207,null,null,null,null,null,null,null,null,null,null,null,null,null,null,null,null,null,null,null,null,null,null,null,null,null,null,null,null,null,null,0,0,0,0,0,0,0,0,0,0,0,0,0,null,null,null,null,null,null,null,null,null,null,null,0,0,"E",null,null,null,null,null,null,null,null,null,null,0,0,"E",null,null,null,null,null,null,null,null,null,0,0,"E",null,null,null,null,null,null,null,null,null,null,null,0,0,"E",null,null,null,null,null,null,null,null,null,null,null,0,0,"E",null,null,null,null,null,null,null,null,null,null,0,0,"E",null,null,null,null,null,null,null,null,0,null,0,"E",null,null,null,null,null,null,null,null,null,0,null,0,"E",null,null,null,null,null,null,null,null,null,0,null,0,"E","---","ERR","","----"]
[null,208,null,null,null,null,null,null,null,null,null,null,null,null,null,null,null,null,null,null,null,null,null,null,null,null,null,null,null,null,null,null,0,0,0,0,0,0,0,0,0,0,0,0,0,null,null,null,null,null,null,null,null,null,null,null,0,0,"E",null,null,null,null,null,null,null,null,null,null,0,0,"E",null,null,null,null,null,null,null,null,null,0,0,"E",null,null,null,null,null,null,null,null,null,null,null,0,0,"E",null,null,null,null,null,null,null,null,null,null,null,0,0,"E",null,null,null,null,null,null,null,null,null,null,0,0,"E",null,null,null,null,null,null,null,null,0,null,0,"E",null,null,null,null,null,null,null,null,null,0,null,0,"E",null,null,null,null,null,null,null,null,null,0,null,0,"E","---","ERR","","----"]
[null,209,null,null,null,null,null,null,null,null,null,null,null,null,null,null,null,null,null,null,null,null,null,null,null,null,null,null,null,null,null,null,0,0,0,0,0,0,0,0,0,0,0,0,0,null,null,null,null,null,null,null,null,null,null,null,0,0,"E",null,null,null,null,null,null,null,null,null,null,0,0,"E",null,null,null,null,null,null,null,null,null,0,0,"E",null,null,null,null,null,null,null,null,null,null,null,0,0,"E",null,null,null,null,null,null,null,null,null,null,null,0,0,"E",null,null,null,null,null,null,null,null,null,null,0,0,"E",null,null,null,null,null,null,null,null,0,null,0,"E",null,null,null,null,null,null,null,null,null,0,null,0,"E",null,null,null,null,null,null,null,null,null,0,null,0,"E","---","ERR","","----"]
[null,210,null,null,null,null,null,null,null,null,null,null,null,null,null,null,null,null,null,null,null,null,null,null,null,null,null,null,null,null,null,null,0,0,0,0,0,0,0,0,0,0,0,0,0,null,null,null,null,null,null,null,null,null,null,null,0,0,"E",null,null,null,null,null,null,null,null,null,null,0,0,"E",null,null,null,null,null,null,null,null,null,0,0,"E",null,null,null,null,null,null,null,null,null,null,null,0,0,"E",null,null,null,null,null,null,null,null,null,null,null,0,0,"E",null,null,null,null,null,null,null,null,null,null,0,0,"E",null,null,null,null,null,null,null,null,0,null,0,"E",null,null,null,null,null,null,null,null,null,0,null,0,"E",null,null,null,null,null,null,null,null,null,0,null,0,"E","---","ERR","","----"]
[null,211,null,null,null,null,null,null,null,null,null,null,null,null,null,null,null,null,null,null,null,null,null,null,null,null,null,null,null,null,null,null,0,0,0,0,0,0,0,0,0,0,0,0,0,null,null,null,null,null,null,null,null,null,null,null,0,0,"E",null,null,null,null,null,null,null,null,null,null,0,0,"E",null,null,null,null,null,null,null,null,null,0,0,"E",null,null,null,null,null,null,null,null,null,null,null,0,0,"E",null,null,null,null,null,null,null,null,null,null,null,0,0,"E",null,null,null,null,null,null,null,null,null,null,0,0,"E",null,null,null,null,null,null,null,null,0,null,0,"E",null,null,null,null,null,null,null,null,null,0,null,0,"E",null,null,null,null,null,null,null,null,null,0,null,0,"E","---","ERR","","----"]
[null,212,null,null,null,null,null,null,null,null,null,null,null,null,null,null,null,null,null,null,null,null,null,null,null,null,null,null,null,null,null,null,0,0,0,0,0,0,0,0,0,0,0,0,0,null,null,null,null,null,null,null,null,null,null,null,0,0,"E",null,null,null,null,null,null,null,null,null,null,0,0,"E",null,null,null,null,null,null,null,null,null,0,0,"E",null,null,null,null,null,null,null,null,null,null,null,0,0,"E",null,null,null,null,null,null,null,null,null,null,null,0,0,"E",null,null,null,null,null,null,null,null,null,null,0,0,"E",null,null,null,null,null,null,null,null,0,null,0,"E",null,null,null,null,null,null,null,null,null,0,null,0,"E",null,null,null,null,null,null,null,null,null,0,null,0,"E","---","ERR","","----"]
[null,213,null,null,null,null,null,null,null,null,null,null,null,null,null,null,null,null,null,null,null,null,null,null,null,null,null,null,null,null,null,null,0,0,0,0,0,0,0,0,0,0,0,0,0,null,null,null,null,null,null,null,null,null,null,null,0,0,"E",null,null,null,null,null,null,null,null,null,null,0,0,"E",null,null,null,null,null,null,null,null,null,0,0,"E",null,null,null,null,null,null,null,null,null,null,null,0,0,"E",null,null,null,null,null,null,null,null,null,null,null,0,0,"E",null,null,null,null,null,null,null,null,null,null,0,0,"E",null,null,null,null,null,null,null,null,0,null,0,"E",null,null,null,null,null,null,null,null,null,0,null,0,"E",null,null,null,null,null,null,null,null,null,0,null,0,"E","---","ERR","","----"]
[null,214,null,null,null,null,null,null,null,null,null,null,null,null,null,null,null,null,null,null,null,null,null,null,null,null,null,null,null,null,null,null,0,0,0,0,0,0,0,0,0,0,0,0,0,null,null,null,null,null,null,null,null,null,null,null,0,0,"E",null,null,null,null,null,null,null,null,null,null,0,0,"E",null,null,null,null,null,null,null,null,null,0,0,"E",null,null,null,null,null,null,null,null,null,null,null,0,0,"E",null,null,null,null,null,null,null,null,null,null,null,0,0,"E",null,null,null,null,null,null,null,null,null,null,0,0,"E",null,null,null,null,null,null,null,null,0,null,0,"E",null,null,null,null,null,null,null,null,null,0,null,0,"E",null,null,null,null,null,null,null,null,null,0,null,0,"E","---","ERR","","----"]
[null,215,null,null,null,null,null,null,null,null,null,null,null,null,null,null,null,null,null,null,null,null,null,null,null,null,null,null,null,null,null,null,0,0,0,0,0,0,0,0,0,0,0,0,0,null,null,null,null,null,null,null,null,null,null,null,0,0,"E",null,null,null,null,null,null,null,null,null,null,0,0,"E",null,null,null,null,null,null,null,null,null,0,0,"E",null,null,null,null,null,null,null,null,null,null,null,0,0,"E",null,null,null,null,null,null,null,null,null,null,null,0,0,"E",null,null,null,null,null,null,null,null,null,null,0,0,"E",null,null,null,null,null,null,null,null,0,null,0,"E",null,null,null,null,null,null,null,null,null,0,null,0,"E",null,null,null,null,null,null,null,null,null,0,null,0,"E","---","ERR","","----"]
[null,216,null,null,null,null,null,null,null,null,null,null,null,null,null,null,null,null,null,null,null,null,null,null,null,null,null,null,null,null,null,null,0,0,0,0,0,0,0,0,0,0,0,0,0,null,null,null,null,null,null,null,null,null,null,null,0,0,"E",null,null,null,null,null,null,null,null,null,null,0,0,"E",null,null,null,null,null,null,null,null,null,0,0,"E",null,null,null,null,null,null,null,null,null,null,null,0,0,"E",null,null,null,null,null,null,null,null,null,null,null,0,0,"E",null,null,null,null,null,null,null,null,null,null,0,0,"E",null,null,null,null,null,null,null,null,0,null,0,"E",null,null,null,null,null,null,null,null,null,0,null,0,"E",null,null,null,null,null,null,null,null,null,0,null,0,"E","---","ERR","","----"]
[null,217,null,null,null,null,null,null,null,null,null,null,null,null,null,null,null,null,null,null,null,null,null,null,null,null,null,null,null,null,null,null,0,0,0,0,0,0,0,0,0,0,0,0,0,null,null,null,null,null,null,null,null,null,null,null,0,0,"E",null,null,null,null,null,null,null,null,null,null,0,0,"E",null,null,null,null,null,null,null,null,null,0,0,"E",null,null,null,null,null,null,null,null,null,null,null,0,0,"E",null,null,null,null,null,null,null,null,null,null,null,0,0,"E",null,null,null,null,null,null,null,null,null,null,0,0,"E",null,null,null,null,null,null,null,null,0,null,0,"E",null,null,null,null,null,null,null,null,null,0,null,0,"E",null,null,null,null,null,null,null,null,null,0,null,0,"E","---","ERR","","----"]
[null,218,null,null,null,null,null,null,null,null,null,null,null,null,null,null,null,null,null,null,null,null,null,null,null,null,null,null,null,null,null,null,0,0,0,0,0,0,0,0,0,0,0,0,0,null,null,null,null,null,null,null,null,null,null,null,0,0,"E",null,null,null,null,null,null,null,null,null,null,0,0,"E",null,null,null,null,null,null,null,null,null,0,0,"E",null,null,null,null,null,null,null,null,null,null,null,0,0,"E",null,null,null,null,null,null,null,null,null,null,null,0,0,"E",null,null,null,null,null,null,null,null,null,null,0,0,"E",null,null,null,null,null,null,null,null,0,null,0,"E",null,null,null,null,null,null,null,null,null,0,null,0,"E",null,null,null,null,null,null,null,null,null,0,null,0,"E","---","ERR","","----"]
[null,219,null,null,null,null,null,null,null,null,null,null,null,null,null,null,null,null,null,null,null,null,null,null,null,null,null,null,null,null,null,null,0,0,0,0,0,0,0,0,0,0,0,0,0,null,null,null,null,null,null,null,null,null,null,null,0,0,"E",null,null,null,null,null,null,null,null,null,null,0,0,"E",null,null,null,null,null,null,null,null,null,0,0,"E",null,null,null,null,null,null,null,null,null,null,null,0,0,"E",null,null,null,null,null,null,null,null,null,null,null,0,0,"E",null,null,null,null,null,null,null,null,null,null,0,0,"E",null,null,null,null,null,null,null,null,0,null,0,"E",null,null,null,null,null,null,null,null,null,0,null,0,"E",null,null,null,null,null,null,null,null,null,0,null,0,"E","---","ERR","","----"]
[null,220,null,null,null,null,null,null,null,null,null,null,null,null,null,null,null,null,null,null,null,null,null,null,null,null,null,null,null,null,null,null,0,0,0,0,0,0,0,0,0,0,0,0,0,null,null,null,null,null,null,null,null,null,null,null,0,0,"E",null,null,null,null,null,null,null,null,null,null,0,0,"E",null,null,null,null,null,null,null,null,null,0,0,"E",null,null,null,null,null,null,null,null,null,null,null,0,0,"E",null,null,null,null,null,null,null,null,null,null,null,0,0,"E",null,null,null,null,null,null,null,null,null,null,0,0,"E",null,null,null,null,null,null,null,null,0,null,0,"E",null,null,null,null,null,null,null,null,null,0,null,0,"E",null,null,null,null,null,null,null,null,null,0,null,0,"E","---","ERR","","----"]
[null,221,null,null,null,null,null,null,null,null,null,null,null,null,null,null,null,null,null,null,null,null,null,null,null,null,null,null,null,null,null,null,0,0,0,0,0,0,0,0,0,0,0,0,0,null,null,null,null,null,null,null,null,null,null,null,0,0,"E",null,null,null,null,null,null,null,null,null,null,0,0,"E",null,null,null,null,null,null,null,null,null,0,0,"E",null,null,null,null,null,null,null,null,null,null,null,0,0,"E",null,null,null,null,null,null,null,null,null,null,null,0,0,"E",null,null,null,null,null,null,null,null,null,null,0,0,"E",null,null,null,null,null,null,null,null,0,null,0,"E",null,null,null,null,null,null,null,null,null,0,null,0,"E",null,null,null,null,null,null,null,null,null,0,null,0,"E","---","ERR","","----"]
[null,222,null,null,null,null,null,null,null,null,null,null,null,null,null,null,null,null,null,null,null,null,null,null,null,null,null,null,null,null,null,null,0,0,0,0,0,0,0,0,0,0,0,0,0,null,null,null,null,null,null,null,null,null,null,null,0,0,"E",null,null,null,null,null,null,null,null,null,null,0,0,"E",null,null,null,null,null,null,null,null,null,0,0,"E",null,null,null,null,null,null,null,null,null,null,null,0,0,"E",null,null,null,null,null,null,null,null,null,null,null,0,0,"E",null,null,null,null,null,null,null,null,null,null,0,0,"E",null,null,null,null,null,null,null,null,0,null,0,"E",null,null,null,null,null,null,null,null,null,0,null,0,"E",null,null,null,null,null,null,null,null,null,0,null,0,"E","---","ERR","","----"]
[null,223,null,null,null,null,null,null,null,null,null,null,null,null,null,null,null,null,null,null,null,null,null,null,null,null,null,null,null,null,null,null,0,0,0,0,0,0,0,0,0,0,0,0,0,null,null,null,null,null,null,null,null,null,null,null,0,0,"E",null,null,null,null,null,null,null,null,null,null,0,0,"E",null,null,null,null,null,null,null,null,null,0,0,"E",null,null,null,null,null,null,null,null,null,null,null,0,0,"E",null,null,null,null,null,null,null,null,null,null,null,0,0,"E",null,null,null,null,null,null,null,null,null,null,0,0,"E",null,null,null,null,null,null,null,null,0,null,0,"E",null,null,null,null,null,null,null,null,null,0,null,0,"E",null,null,null,null,null,null,null,null,null,0,null,0,"E","---","ERR","","----"]
[null,224,null,null,null,null,null,null,null,null,null,null,null,null,null,null,null,null,null,null,null,null,null,null,null,null,null,null,null,null,null,null,0,0,0,0,0,0,0,0,0,0,0,0,0,null,null,null,null,null,null,null,null,null,null,null,0,0,"E",null,null,null,null,null,null,null,null,null,null,0,0,"E",null,null,null,null,null,null,null,null,null,0,0,"E",null,null,null,null,null,null,null,null,null,null,null,0,0,"E",null,null,null,null,null,null,null,null,null,null,null,0,0,"E",null,null,null,null,null,null,null,null,null,null,0,0,"E",null,null,null,null,null,null,null,null,0,null,0,"E",null,null,null,null,null,null,null,null,null,0,null,0,"E",null,null,null,null,null,null,null,null,null,0,null,0,"E","---","ERR","","----"]
[null,225,null,null,null,null,null,null,null,null,null,null,null,null,null,null,null,null,null,null,null,null,null,null,null,null,null,null,null,null,null,null,0,0,0,0,0,0,0,0,0,0,0,0,0,null,null,null,null,null,null,null,null,null,null,null,0,0,"E",null,null,null,null,null,null,null,null,null,null,0,0,"E",null,null,null,null,null,null,null,null,null,0,0,"E",null,null,null,null,null,null,null,null,null,null,null,0,0,"E",null,null,null,null,null,null,null,null,null,null,null,0,0,"E",null,null,null,null,null,null,null,null,null,null,0,0,"E",null,null,null,null,null,null,null,null,0,null,0,"E",null,null,null,null,null,null,null,null,null,0,null,0,"E",null,null,null,null,null,null,null,null,null,0,null,0,"E","---","ERR","","----"]
[null,226,null,null,null,null,null,null,null,null,null,null,null,null,null,null,null,null,null,null,null,null,null,null,null,null,null,null,null,null,null,null,0,0,0,0,0,0,0,0,0,0,0,0,0,null,null,null,null,null,null,null,null,null,null,null,0,0,"E",null,null,null,null,null,null,null,null,null,null,0,0,"E",null,null,null,null,null,null,null,null,null,0,0,"E",null,null,null,null,null,null,null,null,null,null,null,0,0,"E",null,null,null,null,null,null,null,null,null,null,null,0,0,"E",null,null,null,null,null,null,null,null,null,null,0,0,"E",null,null,null,null,null,null,null,null,0,null,0,"E",null,null,null,null,null,null,null,null,null,0,null,0,"E",null,null,null,null,null,null,null,null,null,0,null,0,"E","---","ERR","","----"]
[null,227,null,null,null,null,null,null,null,null,null,null,null,null,null,null,null,null,null,null,null,null,null,null,null,null,null,null,null,null,null,null,0,0,0,0,0,0,0,0,0,0,0,0,0,null,null,null,null,null,null,null,null,null,null,null,0,0,"E",null,null,null,null,null,null,null,null,null,null,0,0,"E",null,null,null,null,null,null,null,null,null,0,0,"E",null,null,null,null,null,null,null,null,null,null,null,0,0,"E",null,null,null,null,null,null,null,null,null,null,null,0,0,"E",null,null,null,null,null,null,null,null,null,null,0,0,"E",null,null,null,null,null,null,null,null,0,null,0,"E",null,null,null,null,null,null,null,null,null,0,null,0,"E",null,null,null,null,null,null,null,null,null,0,null,0,"E","---","ERR","","----"]
[null,228,null,null,null,null,null,null,null,null,null,null,null,null,null,null,null,null,null,null,null,null,null,null,null,null,null,null,null,null,null,null,0,0,0,0,0,0,0,0,0,0,0,0,0,null,null,null,null,null,null,null,null,null,null,null,0,0,"E",null,null,null,null,null,null,null,null,null,null,0,0,"E",null,null,null,null,null,null,null,null,null,0,0,"E",null,null,null,null,null,null,null,null,null,null,null,0,0,"E",null,null,null,null,null,null,null,null,null,null,null,0,0,"E",null,null,null,null,null,null,null,null,null,null,0,0,"E",null,null,null,null,null,null,null,null,0,null,0,"E",null,null,null,null,null,null,null,null,null,0,null,0,"E",null,null,null,null,null,null,null,null,null,0,null,0,"E","---","ERR","","----"]
[null,229,null,null,null,null,null,null,null,null,null,null,null,null,null,null,null,null,null,null,null,null,null,null,null,null,null,null,null,null,null,null,0,0,0,0,0,0,0,0,0,0,0,0,0,null,null,null,null,null,null,null,null,null,null,null,0,0,"E",null,null,null,null,null,null,null,null,null,null,0,0,"E",null,null,null,null,null,null,null,null,null,0,0,"E",null,null,null,null,null,null,null,null,null,null,null,0,0,"E",null,null,null,null,null,null,null,null,null,null,null,0,0,"E",null,null,null,null,null,null,null,null,null,null,0,0,"E",null,null,null,null,null,null,null,null,0,null,0,"E",null,null,null,null,null,null,null,null,null,0,null,0,"E",null,null,null,null,null,null,null,null,null,0,null,0,"E","---","ERR","","----"]
[null,230,null,null,null,null,null,null,null,null,null,null,null,null,null,null,null,null,null,null,null,null,null,null,null,null,null,null,null,null,null,null,0,0,0,0,0,0,0,0,0,0,0,0,0,null,null,null,null,null,null,null,null,null,null,null,0,0,"E",null,null,null,null,null,null,null,null,null,null,0,0,"E",null,null,null,null,null,null,null,null,null,0,0,"E",null,null,null,null,null,null,null,null,null,null,null,0,0,"E",null,null,null,null,null,null,null,null,null,null,null,0,0,"E",null,null,null,null,null,null,null,null,null,null,0,0,"E",null,null,null,null,null,null,null,null,0,null,0,"E",null,null,null,null,null,null,null,null,null,0,null,0,"E",null,null,null,null,null,null,null,null,null,0,null,0,"E","---","ERR","","----"]
[null,231,null,null,null,null,null,null,null,null,null,null,null,null,null,null,null,null,null,null,null,null,null,null,null,null,null,null,null,null,null,null,0,0,0,0,0,0,0,0,0,0,0,0,0,null,null,null,null,null,null,null,null,null,null,null,0,0,"E",null,null,null,null,null,null,null,null,null,null,0,0,"E",null,null,null,null,null,null,null,null,null,0,0,"E",null,null,null,null,null,null,null,null,null,null,null,0,0,"E",null,null,null,null,null,null,null,null,null,null,null,0,0,"E",null,null,null,null,null,null,null,null,null,null,0,0,"E",null,null,null,null,null,null,null,null,0,null,0,"E",null,null,null,null,null,null,null,null,null,0,null,0,"E",null,null,null,null,null,null,null,null,null,0,null,0,"E","---","ERR","","----"]
[null,232,null,null,null,null,null,null,null,null,null,null,null,null,null,null,null,null,null,null,null,null,null,null,null,null,null,null,null,null,null,null,0,0,0,0,0,0,0,0,0,0,0,0,0,null,null,null,null,null,null,null,null,null,null,null,0,0,"E",null,null,null,null,null,null,null,null,null,null,0,0,"E",null,null,null,null,null,null,null,null,null,0,0,"E",null,null,null,null,null,null,null,null,null,null,null,0,0,"E",null,null,null,null,null,null,null,null,null,null,null,0,0,"E",null,null,null,null,null,null,null,null,null,null,0,0,"E",null,null,null,null,null,null,null,null,0,null,0,"E",null,null,null,null,null,null,null,null,null,0,null,0,"E",null,null,null,null,null,null,null,null,null,0,null,0,"E","---","ERR","","----"]
[null,233,null,null,null,null,null,null,null,null,null,null,null,null,null,null,null,null,null,null,null,null,null,null,null,null,null,null,null,null,null,null,0,0,0,0,0,0,0,0,0,0,0,0,0,null,null,null,null,null,null,null,null,null,null,null,0,0,"E",null,null,null,null,null,null,null,null,null,null,0,0,"E",null,null,null,null,null,null,null,null,null,0,0,"E",null,null,null,null,null,null,null,null,null,null,null,0,0,"E",null,null,null,null,null,null,null,null,null,null,null,0,0,"E",null,null,null,null,null,null,null,null,null,null,0,0,"E",null,null,null,null,null,null,null,null,0,null,0,"E",null,null,null,null,null,null,null,null,null,0,null,0,"E",null,null,null,null,null,null,null,null,null,0,null,0,"E","---","ERR","","----"]
[null,234,null,null,null,null,null,null,null,null,null,null,null,null,null,null,null,null,null,null,null,null,null,null,null,null,null,null,null,null,null,null,0,0,0,0,0,0,0,0,0,0,0,0,0,null,null,null,null,null,null,null,null,null,null,null,0,0,"E",null,null,null,null,null,null,null,null,null,null,0,0,"E",null,null,null,null,null,null,null,null,null,0,0,"E",null,null,null,null,null,null,null,null,null,null,null,0,0,"E",null,null,null,null,null,null,null,null,null,null,null,0,0,"E",null,null,null,null,null,null,null,null,null,null,0,0,"E",null,null,null,null,null,null,null,null,0,null,0,"E",null,null,null,null,null,null,null,null,null,0,null,0,"E",null,null,null,null,null,null,null,null,null,0,null,0,"E","---","ERR","","----"]
[null,235,null,null,null,null,null,null,null,null,null,null,null,null,null,null,null,null,null,null,null,null,null,null,null,null,null,null,null,null,null,null,0,0,0,0,0,0,0,0,0,0,0,0,0,null,null,null,null,null,null,null,null,null,null,null,0,0,"E",null,null,null,null,null,null,null,null,null,null,0,0,"E",null,null,null,null,null,null,null,null,null,0,0,"E",null,null,null,null,null,null,null,null,null,null,null,0,0,"E",null,null,null,null,null,null,null,null,null,null,null,0,0,"E",null,null,null,null,null,null,null,null,null,null,0,0,"E",null,null,null,null,null,null,null,null,0,null,0,"E",null,null,null,null,null,null,null,null,null,0,null,0,"E",null,null,null,null,null,null,null,null,null,0,null,0,"E","---","ERR","","----"]
[null,236,null,null,null,null,null,null,null,null,null,null,null,null,null,null,null,null,null,null,null,null,null,null,null,null,null,null,null,null,null,null,0,0,0,0,0,0,0,0,0,0,0,0,0,null,null,null,null,null,null,null,null,null,null,null,0,0,"E",null,null,null,null,null,null,null,null,null,null,0,0,"E",null,null,null,null,null,null,null,null,null,0,0,"E",null,null,null,null,null,null,null,null,null,null,null,0,0,"E",null,null,null,null,null,null,null,null,null,null,null,0,0,"E",null,null,null,null,null,null,null,null,null,null,0,0,"E",null,null,null,null,null,null,null,null,0,null,0,"E",null,null,null,null,null,null,null,null,null,0,null,0,"E",null,null,null,null,null,null,null,null,null,0,null,0,"E","---","ERR","","----"]
[null,237,null,null,null,null,null,null,null,null,null,null,null,null,null,null,null,null,null,null,null,null,null,null,null,null,null,null,null,null,null,null,0,0,0,0,0,0,0,0,0,0,0,0,0,null,null,null,null,null,null,null,null,null,null,null,0,0,"E",null,null,null,null,null,null,null,null,null,null,0,0,"E",null,null,null,null,null,null,null,null,null,0,0,"E",null,null,null,null,null,null,null,null,null,null,null,0,0,"E",null,null,null,null,null,null,null,null,null,null,null,0,0,"E",null,null,null,null,null,null,null,null,null,null,0,0,"E",null,null,null,null,null,null,null,null,0,null,0,"E",null,null,null,null,null,null,null,null,null,0,null,0,"E",null,null,null,null,null,null,null,null,null,0,null,0,"E","---","ERR","","----"]
[null,238,null,null,null,null,null,null,null,null,null,null,null,null,null,null,null,null,null,null,null,null,null,null,null,null,null,null,null,null,null,null,0,0,0,0,0,0,0,0,0,0,0,0,0,null,null,null,null,null,null,null,null,null,null,null,0,0,"E",null,null,null,null,null,null,null,null,null,null,0,0,"E",null,null,null,null,null,null,null,null,null,0,0,"E",null,null,null,null,null,null,null,null,null,null,null,0,0,"E",null,null,null,null,null,null,null,null,null,null,null,0,0,"E",null,null,null,null,null,null,null,null,null,null,0,0,"E",null,null,null,null,null,null,null,null,0,null,0,"E",null,null,null,null,null,null,null,null,null,0,null,0,"E",null,null,null,null,null,null,null,null,null,0,null,0,"E","---","ERR","","----"]
[null,239,null,null,null,null,null,null,null,null,null,null,null,null,null,null,null,null,null,null,null,null,null,null,null,null,null,null,null,null,null,null,0,0,0,0,0,0,0,0,0,0,0,0,0,null,null,null,null,null,null,null,null,null,null,null,0,0,"E",null,null,null,null,null,null,null,null,null,null,0,0,"E",null,null,null,null,null,null,null,null,null,0,0,"E",null,null,null,null,null,null,null,null,null,null,null,0,0,"E",null,null,null,null,null,null,null,null,null,null,null,0,0,"E",null,null,null,null,null,null,null,null,null,null,0,0,"E",null,null,null,null,null,null,null,null,0,null,0,"E",null,null,null,null,null,null,null,null,null,0,null,0,"E",null,null,null,null,null,null,null,null,null,0,null,0,"E","---","ERR","","----"]
[null,240,null,null,null,null,null,null,null,null,null,null,null,null,null,null,null,null,null,null,null,null,null,null,null,null,null,null,null,null,null,null,0,0,0,0,0,0,0,0,0,0,0,0,0,null,null,null,null,null,null,null,null,null,null,null,0,0,"E",null,null,null,null,null,null,null,null,null,null,0,0,"E",null,null,null,null,null,null,null,null,null,0,0,"E",null,null,null,null,null,null,null,null,null,null,null,0,0,"E",null,null,null,null,null,null,null,null,null,null,null,0,0,"E",null,null,null,null,null,null,null,null,null,null,0,0,"E",null,null,null,null,null,null,null,null,0,null,0,"E",null,null,null,null,null,null,null,null,null,0,null,0,"E",null,null,null,null,null,null,null,null,null,0,null,0,"E","---","ERR","","----"]
[null,241,null,null,null,null,null,null,null,null,null,null,null,null,null,null,null,null,null,null,null,null,null,null,null,null,null,null,null,null,null,null,0,0,0,0,0,0,0,0,0,0,0,0,0,null,null,null,null,null,null,null,null,null,null,null,0,0,"E",null,null,null,null,null,null,null,null,null,null,0,0,"E",null,null,null,null,null,null,null,null,null,0,0,"E",null,null,null,null,null,null,null,null,null,null,null,0,0,"E",null,null,null,null,null,null,null,null,null,null,null,0,0,"E",null,null,null,null,null,null,null,null,null,null,0,0,"E",null,null,null,null,null,null,null,null,0,null,0,"E",null,null,null,null,null,null,null,null,null,0,null,0,"E",null,null,null,null,null,null,null,null,null,0,null,0,"E","---","ERR","","----"]
[null,242,null,null,null,null,null,null,null,null,null,null,null,null,null,null,null,null,null,null,null,null,null,null,null,null,null,null,null,null,null,null,0,0,0,0,0,0,0,0,0,0,0,0,0,null,null,null,null,null,null,null,null,null,null,null,0,0,"E",null,null,null,null,null,null,null,null,null,null,0,0,"E",null,null,null,null,null,null,null,null,null,0,0,"E",null,null,null,null,null,null,null,null,null,null,null,0,0,"E",null,null,null,null,null,null,null,null,null,null,null,0,0,"E",null,null,null,null,null,null,null,null,null,null,0,0,"E",null,null,null,null,null,null,null,null,0,null,0,"E",null,null,null,null,null,null,null,null,null,0,null,0,"E",null,null,null,null,null,null,null,null,null,0,null,0,"E","---","ERR","","----"]
[null,243,null,null,null,null,null,null,null,null,null,null,null,null,null,null,null,null,null,null,null,null,null,null,null,null,null,null,null,null,null,null,0,0,0,0,0,0,0,0,0,0,0,0,0,null,null,null,null,null,null,null,null,null,null,null,0,0,"E",null,null,null,null,null,null,null,null,null,null,0,0,"E",null,null,null,null,null,null,null,null,null,0,0,"E",null,null,null,null,null,null,null,null,null,null,null,0,0,"E",null,null,null,null,null,null,null,null,null,null,null,0,0,"E",null,null,null,null,null,null,null,null,null,null,0,0,"E",null,null,null,null,null,null,null,null,0,null,0,"E",null,null,null,null,null,null,null,null,null,0,null,0,"E",null,null,null,null,null,null,null,null,null,0,null,0,"E","---","ERR","","----"]
[null,244,null,null,null,null,null,null,null,null,null,null,null,null,null,null,null,null,null,null,null,null,null,null,null,null,null,null,null,null,null,null,0,0,0,0,0,0,0,0,0,0,0,0,0,null,null,null,null,null,null,null,null,null,null,null,0,0,"E",null,null,null,null,null,null,null,null,null,null,0,0,"E",null,null,null,null,null,null,null,null,null,0,0,"E",null,null,null,null,null,null,null,null,null,null,null,0,0,"E",null,null,null,null,null,null,null,null,null,null,null,0,0,"E",null,null,null,null,null,null,null,null,null,null,0,0,"E",null,null,null,null,null,null,null,null,0,null,0,"E",null,null,null,null,null,null,null,null,null,0,null,0,"E",null,null,null,null,null,null,null,null,null,0,null,0,"E","---","ERR","","----"]
[null,245,null,null,null,null,null,null,null,null,null,null,null,null,null,null,null,null,null,null,null,null,null,null,null,null,null,null,null,null,null,null,0,0,0,0,0,0,0,0,0,0,0,0,0,null,null,null,null,null,null,null,null,null,null,null,0,0,"E",null,null,null,null,null,null,null,null,null,null,0,0,"E",null,null,null,null,null,null,null,null,null,0,0,"E",null,null,null,null,null,null,null,null,null,null,null,0,0,"E",null,null,null,null,null,null,null,null,null,null,null,0,0,"E",null,null,null,null,null,null,null,null,null,null,0,0,"E",null,null,null,null,null,null,null,null,0,null,0,"E",null,null,null,null,null,null,null,null,null,0,null,0,"E",null,null,null,null,null,null,null,null,null,0,null,0,"E","---","ERR","","----"]
[null,246,null,null,null,null,null,null,null,null,null,null,null,null,null,null,null,null,null,null,null,null,null,null,null,null,null,null,null,null,null,null,0,0,0,0,0,0,0,0,0,0,0,0,0,null,null,null,null,null,null,null,null,null,null,null,0,0,"E",null,null,null,null,null,null,null,null,null,null,0,0,"E",null,null,null,null,null,null,null,null,null,0,0,"E",null,null,null,null,null,null,null,null,null,null,null,0,0,"E",null,null,null,null,null,null,null,null,null,null,null,0,0,"E",null,null,null,null,null,null,null,null,null,null,0,0,"E",null,null,null,null,null,null,null,null,0,null,0,"E",null,null,null,null,null,null,null,null,null,0,null,0,"E",null,null,null,null,null,null,null,null,null,0,null,0,"E","---","ERR","","----"]
[null,247,null,null,null,null,null,null,null,null,null,null,null,null,null,null,null,null,null,null,null,null,null,null,null,null,null,null,null,null,null,null,0,0,0,0,0,0,0,0,0,0,0,0,0,null,null,null,null,null,null,null,null,null,null,null,0,0,"E",null,null,null,null,null,null,null,null,null,null,0,0,"E",null,null,null,null,null,null,null,null,null,0,0,"E",null,null,null,null,null,null,null,null,null,null,null,0,0,"E",null,null,null,null,null,null,null,null,null,null,null,0,0,"E",null,null,null,null,null,null,null,null,null,null,0,0,"E",null,null,null,null,null,null,null,null,0,null,0,"E",null,null,null,null,null,null,null,null,null,0,null,0,"E",null,null,null,null,null,null,null,null,null,0,null,0,"E","---","ERR","","----"]
[null,248,null,null,null,null,null,null,null,null,null,null,null,null,null,null,null,null,null,null,null,null,null,null,null,null,null,null,null,null,null,null,0,0,0,0,0,0,0,0,0,0,0,0,0,null,null,null,null,null,null,null,null,null,null,null,0,0,"E",null,null,null,null,null,null,null,null,null,null,0,0,"E",null,null,null,null,null,null,null,null,null,0,0,"E",null,null,null,null,null,null,null,null,null,null,null,0,0,"E",null,null,null,null,null,null,null,null,null,null,null,0,0,"E",null,null,null,null,null,null,null,null,null,null,0,0,"E",null,null,null,null,null,null,null,null,0,null,0,"E",null,null,null,null,null,null,null,null,null,0,null,0,"E",null,null,null,null,null,null,null,null,null,0,null,0,"E","---","ERR","","----"]
[null,249,null,null,null,null,null,null,null,null,null,null,null,null,null,null,null,null,null,null,null,null,null,null,null,null,null,null,null,null,null,null,0,0,0,0,0,0,0,0,0,0,0,0,0,null,null,null,null,null,null,null,null,null,null,null,0,0,"E",null,null,null,null,null,null,null,null,null,null,0,0,"E",null,null,null,null,null,null,null,null,null,0,0,"E",null,null,null,null,null,null,null,null,null,null,null,0,0,"E",null,null,null,null,null,null,null,null,null,null,null,0,0,"E",null,null,null,null,null,null,null,null,null,null,0,0,"E",null,null,null,null,null,null,null,null,0,null,0,"E",null,null,null,null,null,null,null,null,null,0,null,0,"E",null,null,null,null,null,null,null,null,null,0,null,0,"E","---","ERR","","----"]
[null,250,null,null,null,null,null,null,null,null,null,null,null,null,null,null,null,null,null,null,null,null,null,null,null,null,null,null,null,null,null,null,0,0,0,0,0,0,0,0,0,0,0,0,0,null,null,null,null,null,null,null,null,null,null,null,0,0,"E",null,null,null,null,null,null,null,null,null,null,0,0,"E",null,null,null,null,null,null,null,null,null,0,0,"E",null,null,null,null,null,null,null,null,null,null,null,0,0,"E",null,null,null,null,null,null,null,null,null,null,null,0,0,"E",null,null,null,null,null,null,null,null,null,null,0,0,"E",null,null,null,null,null,null,null,null,0,null,0,"E",null,null,null,null,null,null,null,null,null,0,null,0,"E",null,null,null,null,null,null,null,null,null,0,null,0,"E","---","ERR","","----"]
[null,251,null,null,null,null,null,null,null,null,null,null,null,null,null,null,null,null,null,null,null,null,null,null,null,null,null,null,null,null,null,null,0,0,0,0,0,0,0,0,0,0,0,0,0,null,null,null,null,null,null,null,null,null,null,null,0,0,"E",null,null,null,null,null,null,null,null,null,null,0,0,"E",null,null,null,null,null,null,null,null,null,0,0,"E",null,null,null,null,null,null,null,null,null,null,null,0,0,"E",null,null,null,null,null,null,null,null,null,null,null,0,0,"E",null,null,null,null,null,null,null,null,null,null,0,0,"E",null,null,null,null,null,null,null,null,0,null,0,"E",null,null,null,null,null,null,null,null,null,0,null,0,"E",null,null,null,null,null,null,null,null,null,0,null,0,"E","---","ERR","","----"]
[null,252,null,null,null,null,null,null,null,null,null,null,null,null,null,null,null,null,null,null,null,null,null,null,null,null,null,null,null,null,null,null,0,0,0,0,0,0,0,0,0,0,0,0,0,null,null,null,null,null,null,null,null,null,null,null,0,0,"E",null,null,null,null,null,null,null,null,null,null,0,0,"E",null,null,null,null,null,null,null,null,null,0,0,"E",null,null,null,null,null,null,null,null,null,null,null,0,0,"E",null,null,null,null,null,null,null,null,null,null,null,0,0,"E",null,null,null,null,null,null,null,null,null,null,0,0,"E",null,null,null,null,null,null,null,null,0,null,0,"E",null,null,null,null,null,null,null,null,null,0,null,0,"E",null,null,null,null,null,null,null,null,null,0,null,0,"E","---","ERR","","----"]
[null,253,null,null,null,null,null,null,null,null,null,null,null,null,null,null,null,null,null,null,null,null,null,null,null,null,null,null,null,null,null,null,0,0,0,0,0,0,0,0,0,0,0,0,0,null,null,null,null,null,null,null,null,null,null,null,0,0,"E",null,null,null,null,null,null,null,null,null,null,0,0,"E",null,null,null,null,null,null,null,null,null,0,0,"E",null,null,null,null,null,null,null,null,null,null,null,0,0,"E",null,null,null,null,null,null,null,null,null,null,null,0,0,"E",null,null,null,null,null,null,null,null,null,null,0,0,"E",null,null,null,null,null,null,null,null,0,null,0,"E",null,null,null,null,null,null,null,null,null,0,null,0,"E",null,null,null,null,null,null,null,null,null,0,null,0,"E","---","ERR","","----"]
[null,254,null,null,null,null,null,null,null,null,null,null,null,null,null,null,null,null,null,null,null,null,null,null,null,null,null,null,null,null,null,null,0,0,0,0,0,0,0,0,0,0,0,0,0,null,null,null,null,null,null,null,null,null,null,null,0,0,"E",null,null,null,null,null,null,null,null,null,null,0,0,"E",null,null,null,null,null,null,null,null,null,0,0,"E",null,null,null,null,null,null,null,null,null,null,null,0,0,"E",null,null,null,null,null,null,null,null,null,null,null,0,0,"E",null,null,null,null,null,null,null,null,null,null,0,0,"E",null,null,null,null,null,null,null,null,0,null,0,"E",null,null,null,null,null,null,null,null,null,0,null,0,"E",null,null,null,null,null,null,null,null,null,0,null,0,"E","---","ERR","","----"]
[null,255,null,null,null,null,null,null,null,null,null,null,null,null,null,null,null,null,null,null,null,null,null,null,null,null,null,null,null,null,null,null,0,0,0,0,0,0,0,0,0,0,0,0,0,null,null,null,null,null,null,null,null,null,null,null,0,0,"E",null,null,null,null,null,null,null,null,null,null,0,0,"E",null,null,null,null,null,null,null,null,null,0,0,"E",null,null,null,null,null,null,null,null,null,null,null,0,0,"E",null,null,null,null,null,null,null,null,null,null,null,0,0,"E",null,null,null,null,null,null,null,null,null,null,0,0,"E",null,null,null,null,null,null,null,null,0,null,0,"E",null,null,null,null,null,null,null,null,null,0,null,0,"E",null,null,null,null,null,null,null,null,null,0,null,0,"E","---","ERR","","----"]
[null,256,null,null,null,null,null,null,null,null,null,null,null,null,null,null,null,null,null,null,null,null,null,null,null,null,null,null,null,null,null,null,0,0,0,0,0,0,0,0,0,0,0,0,0,null,null,null,null,null,null,null,null,null,null,null,0,0,"E",null,null,null,null,null,null,null,null,null,null,0,0,"E",null,null,null,null,null,null,null,null,null,0,0,"E",null,null,null,null,null,null,null,null,null,null,null,0,0,"E",null,null,null,null,null,null,null,null,null,null,null,0,0,"E",null,null,null,null,null,null,null,null,null,null,0,0,"E",null,null,null,null,null,null,null,null,0,null,0,"E",null,null,null,null,null,null,null,null,null,0,null,0,"E",null,null,null,null,null,null,null,null,null,0,null,0,"E","---","ERR","","----"]
[null,257,null,null,null,null,null,null,null,null,null,null,null,null,null,null,null,null,null,null,null,null,null,null,null,null,null,null,null,null,null,null,0,0,0,0,0,0,0,0,0,0,0,0,0,null,null,null,null,null,null,null,null,null,null,null,0,0,"E",null,null,null,null,null,null,null,null,null,null,0,0,"E",null,null,null,null,null,null,null,null,null,0,0,"E",null,null,null,null,null,null,null,null,null,null,null,0,0,"E",null,null,null,null,null,null,null,null,null,null,null,0,0,"E",null,null,null,null,null,null,null,null,null,null,0,0,"E",null,null,null,null,null,null,null,null,0,null,0,"E",null,null,null,null,null,null,null,null,null,0,null,0,"E",null,null,null,null,null,null,null,null,null,0,null,0,"E","---","ERR","","----"]
[null,258,null,null,null,null,null,null,null,null,null,null,null,null,null,null,null,null,null,null,null,null,null,null,null,null,null,null,null,null,null,null,{"$f":"SUM(V264:AF264)","v":0},{"$f":"V264/$V$4","v":0},{"$f":"W264/$W$4","v":0},{"$f":"X264/$X$4","v":0},{"$f":"Y264/$Y$4","v":0},{"$f":"Z264/$Z$4","v":0},{"$f":"AA264/$AA$4","v":0},{"$f":"AB264/$AB$4","v":0},{"$f":"AC264/$AC$4","v":0},{"$f":"AD264/$AD$4","v":0},{"$f":"AE264/$AE$4","v":0},{"$f":"AF264/$AF$4","v":0},{"$f":"AG264/$AG$4","v":0},null,null,null,null,null,null,null,null,null,null,null,{"$f":"SUM(AZ264:BD264)","v":0},{"$f":"BE264+AY264","v":0},{"$f":"IFERROR(IF(BF264>90,\"A+\",IF(BF264>80,\"A\",IF(BF264>70,\"B+\",IF(BF264>60,\"B\",IF(BF264>50,\"C+\",IF(BF264>40,\"C\",IF(BF264>=33,\"D\",\"E\"))))))),\"Abs\")","v":"E"},null,null,null,null,null,null,null,null,null,null,{"$f":"SUM(BM264:BQ264)","v":0},{"$f":"BR264+BL264","v":0},{"$f":"IFERROR(IF(BS264>90,\"A+\",IF(BS264>80,\"A\",IF(BS264>70,\"B+\",IF(BS264>60,\"B\",IF(BS264>50,\"C+\",IF(BS264>40,\"C\",IF(BS264>=33,\"D\",\"E\"))))))),\"Abs\")","v":"E"},null,null,null,null,null,null,null,null,null,{"$f":"SUM(BZ264:CC264)","v":0},{"$f":"CD264+BY264","v":0},{"$f":"IFERROR(IF(CE264>90,\"A+\",IF(CE264>80,\"A\",IF(CE264>70,\"B+\",IF(CE264>60,\"B\",IF(CE264>50,\"C+\",IF(CE264>40,\"C\",IF(CE264>=33,\"D\",\"E\"))))))),\"Abs\")","v":"E"},null,null,null,null,null,null,null,null,null,null,null,{"$f":"SUM(CL264:CQ264)","v":0},{"$f":"CR264+CK264","v":0},{"$f":"IFERROR(IF(CS264>90,\"A+\",IF(CS264>80,\"A\",IF(CS264>70,\"B+\",IF(CS264>60,\"B\",IF(CS264>50,\"C+\",IF(CS264>40,\"C\",IF(CS264>=33,\"D\",\"E\"))))))),\"Abs\")","v":"E"},null,null,null,null,null,null,null,null,null,null,null,{"$f":"SUM(CZ264:DE264)","v":0},{"$f":"DF264+CY264","v":0},{"$f":"IFERROR(IF(DG264>90,\"A+\",IF(DG264>80,\"A\",IF(DG264>70,\"B+\",IF(DG264>60,\"B\",IF(DG264>50,\"C+\",IF(DG264>40,\"C\",IF(DG264>=33,\"D\",\"E\"))))))),\"Abs\")","v":"E"},null,null,null,null,null,null,null,null,null,null,{"$f":"SUM(DN264:DR264)","v":0},{"$f":"DS264+DM264","v":0},{"$f":"IFERROR(IF(DT264>90,\"A+\",IF(DT264>80,\"A\",IF(DT264>70,\"B+\",IF(DT264>60,\"B\",IF(DT264>50,\"C+\",IF(DT264>40,\"C\",IF(DT264>=33,\"D\",\"E\"))))))),\"Abs\")","v":"E"},null,null,null,null,null,null,null,null,{"$f":"SUM(EA264:EC264)","v":0},null,{"$f":"EE264+ED264+DZ264","v":0},{"$f":"IFERROR(IF(EF264>90,\"A+\",IF(EF264>80,\"A\",IF(EF264>70,\"B+\",IF(EF264>60,\"B\",IF(EF264>50,\"C+\",IF(EF264>40,\"C\",IF(EF264>=33,\"D\",\"E\"))))))),\"Abs\")","v":"E"},null,null,null,null,null,null,null,null,null,{"$f":"SUM(EM264:EP264)","v":0},null,{"$f":"ER264+EQ264+EL264","v":0},{"$f":"IFERROR(IF(ES264>90,\"A+\",IF(ES264>80,\"A\",IF(ES264>70,\"B+\",IF(ES264>60,\"B\",IF(ES264>50,\"C+\",IF(ES264>40,\"C\",IF(ES264>=33,\"D\",\"E\"))))))),\"Abs\")","v":"E"},null,null,null,null,null,null,null,null,null,{"$f":"SUM(EZ264:FC264)","v":0},null,{"$f":"FE264+FD264+EY264","v":0},{"$f":"IFERROR(IF(FF264>90,\"A+\",IF(FF264>80,\"A\",IF(FF264>70,\"B+\",IF(FF264>60,\"B\",IF(FF264>50,\"C+\",IF(FF264>40,\"C\",IF(FF264>=33,\"D\",\"E\"))))))),\"Abs\")","v":"E"},{"$f":"IF(AND(MIN(AY264,BL264,BY264,CK264,CY264,DM264)>19,MIN(BF264,BS264,CE264,CS264,DG264,DT264)>32),SUM(BF264,BS264,CE264,CS264,DG264,DT264),\"---\")","v":"---"},{"$f":"IFERROR(FH264/600*100,\"ERR\")","v":"ERR"},{"$f":"IF(FI264=\"ERR\",\"\",(IF(FI264>90,\"A+\",IF(FI264>80,\"A\",IF(FI264>70,\"B+\",IF(FI264>60,\"B\",IF(FI264>50,\"C+\",IF(FI264>40,\"C\",IF(FI264>=33,\"D\",IF(FI264<33,\"E\",\"\"))))))))))","v":""},{"$f":"IF(FI264=\"ERR\",\"----\",IF(FI264>=33,\"ਪਾਸ\",\"--\"))","v":"----"}]
[null,259,null,null,null,null,null,null,null,null,null,null,null,null,null,null,null,null,null,null,null,null,null,null,null,null,null,null,null,null,null,null,0,0,0,0,0,0,0,0,0,0,0,0,0,null,null,null,null,null,null,null,null,null,null,null,0,0,"E",null,null,null,null,null,null,null,null,null,null,0,0,"E",null,null,null,null,null,null,null,null,null,0,0,"E",null,null,null,null,null,null,null,null,null,null,null,0,0,"E",null,null,null,null,null,null,null,null,null,null,null,0,0,"E",null,null,null,null,null,null,null,null,null,null,0,0,"E",null,null,null,null,null,null,null,null,0,null,0,"E",null,null,null,null,null,null,null,null,null,0,null,0,"E",null,null,null,null,null,null,null,null,null,0,null,0,"E","---","ERR","","----"]
[null,260,null,null,null,null,null,null,null,null,null,null,null,null,null,null,null,null,null,null,null,null,null,null,null,null,null,null,null,null,null,null,0,0,0,0,0,0,0,0,0,0,0,0,0,null,null,null,null,null,null,null,null,null,null,null,0,0,"E",null,null,null,null,null,null,null,null,null,null,0,0,"E",null,null,null,null,null,null,null,null,null,0,0,"E",null,null,null,null,null,null,null,null,null,null,null,0,0,"E",null,null,null,null,null,null,null,null,null,null,null,0,0,"E",null,null,null,null,null,null,null,null,null,null,0,0,"E",null,null,null,null,null,null,null,null,0,null,0,"E",null,null,null,null,null,null,null,null,null,0,null,0,"E",null,null,null,null,null,null,null,null,null,0,null,0,"E","---","ERR","","----"]
[null,261,null,null,null,null,null,null,null,null,null,null,null,null,null,null,null,null,null,null,null,null,null,null,null,null,null,null,null,null,null,null,0,0,0,0,0,0,0,0,0,0,0,0,0,null,null,null,null,null,null,null,null,null,null,null,0,0,"E",null,null,null,null,null,null,null,null,null,null,0,0,"E",null,null,null,null,null,null,null,null,null,0,0,"E",null,null,null,null,null,null,null,null,null,null,null,0,0,"E",null,null,null,null,null,null,null,null,null,null,null,0,0,"E",null,null,null,null,null,null,null,null,null,null,0,0,"E",null,null,null,null,null,null,null,null,0,null,0,"E",null,null,null,null,null,null,null,null,null,0,null,0,"E",null,null,null,null,null,null,null,null,null,0,null,0,"E","---","ERR","","----"]
[null,262,null,null,null,null,null,null,null,null,null,null,null,null,null,null,null,null,null,null,null,null,null,null,null,null,null,null,null,null,null,null,0,0,0,0,0,0,0,0,0,0,0,0,0,null,null,null,null,null,null,null,null,null,null,null,0,0,"E",null,null,null,null,null,null,null,null,null,null,0,0,"E",null,null,null,null,null,null,null,null,null,0,0,"E",null,null,null,null,null,null,null,null,null,null,null,0,0,"E",null,null,null,null,null,null,null,null,null,null,null,0,0,"E",null,null,null,null,null,null,null,null,null,null,0,0,"E",null,null,null,null,null,null,null,null,0,null,0,"E",null,null,null,null,null,null,null,null,null,0,null,0,"E",null,null,null,null,null,null,null,null,null,0,null,0,"E","---","ERR","","----"]
[null,263,null,null,null,null,null,null,null,null,null,null,null,null,null,null,null,null,null,null,null,null,null,null,null,null,null,null,null,null,null,null,0,0,0,0,0,0,0,0,0,0,0,0,0,null,null,null,null,null,null,null,null,null,null,null,0,0,"E",null,null,null,null,null,null,null,null,null,null,0,0,"E",null,null,null,null,null,null,null,null,null,0,0,"E",null,null,null,null,null,null,null,null,null,null,null,0,0,"E",null,null,null,null,null,null,null,null,null,null,null,0,0,"E",null,null,null,null,null,null,null,null,null,null,0,0,"E",null,null,null,null,null,null,null,null,0,null,0,"E",null,null,null,null,null,null,null,null,null,0,null,0,"E",null,null,null,null,null,null,null,null,null,0,null,0,"E","---","ERR","","----"]
[null,264,null,null,null,null,null,null,null,null,null,null,null,null,null,null,null,null,null,null,null,null,null,null,null,null,null,null,null,null,null,null,0,0,0,0,0,0,0,0,0,0,0,0,0,null,null,null,null,null,null,null,null,null,null,null,0,0,"E",null,null,null,null,null,null,null,null,null,null,0,0,"E",null,null,null,null,null,null,null,null,null,0,0,"E",null,null,null,null,null,null,null,null,null,null,null,0,0,"E",null,null,null,null,null,null,null,null,null,null,null,0,0,"E",null,null,null,null,null,null,null,null,null,null,0,0,"E",null,null,null,null,null,null,null,null,0,null,0,"E",null,null,null,null,null,null,null,null,null,0,null,0,"E",null,null,null,null,null,null,null,null,null,0,null,0,"E","---","ERR","","----"]
[null,265,null,null,null,null,null,null,null,null,null,null,null,null,null,null,null,null,null,null,null,null,null,null,null,null,null,null,null,null,null,null,0,0,0,0,0,0,0,0,0,0,0,0,0,null,null,null,null,null,null,null,null,null,null,null,0,0,"E",null,null,null,null,null,null,null,null,null,null,0,0,"E",null,null,null,null,null,null,null,null,null,0,0,"E",null,null,null,null,null,null,null,null,null,null,null,0,0,"E",null,null,null,null,null,null,null,null,null,null,null,0,0,"E",null,null,null,null,null,null,null,null,null,null,0,0,"E",null,null,null,null,null,null,null,null,0,null,0,"E",null,null,null,null,null,null,null,null,null,0,null,0,"E",null,null,null,null,null,null,null,null,null,0,null,0,"E","---","ERR","","----"]
[null,266,null,null,null,null,null,null,null,null,null,null,null,null,null,null,null,null,null,null,null,null,null,null,null,null,null,null,null,null,null,null,0,0,0,0,0,0,0,0,0,0,0,0,0,null,null,null,null,null,null,null,null,null,null,null,0,0,"E",null,null,null,null,null,null,null,null,null,null,0,0,"E",null,null,null,null,null,null,null,null,null,0,0,"E",null,null,null,null,null,null,null,null,null,null,null,0,0,"E",null,null,null,null,null,null,null,null,null,null,null,0,0,"E",null,null,null,null,null,null,null,null,null,null,0,0,"E",null,null,null,null,null,null,null,null,0,null,0,"E",null,null,null,null,null,null,null,null,null,0,null,0,"E",null,null,null,null,null,null,null,null,null,0,null,0,"E","---","ERR","","----"]
[null,267,null,null,null,null,null,null,null,null,null,null,null,null,null,null,null,null,null,null,null,null,null,null,null,null,null,null,null,null,null,null,0,0,0,0,0,0,0,0,0,0,0,0,0,null,null,null,null,null,null,null,null,null,null,null,0,0,"E",null,null,null,null,null,null,null,null,null,null,0,0,"E",null,null,null,null,null,null,null,null,null,0,0,"E",null,null,null,null,null,null,null,null,null,null,null,0,0,"E",null,null,null,null,null,null,null,null,null,null,null,0,0,"E",null,null,null,null,null,null,null,null,null,null,0,0,"E",null,null,null,null,null,null,null,null,0,null,0,"E",null,null,null,null,null,null,null,null,null,0,null,0,"E",null,null,null,null,null,null,null,null,null,0,null,0,"E","---","ERR","","----"]
[null,268,null,null,null,null,null,null,null,null,null,null,null,null,null,null,null,null,null,null,null,null,null,null,null,null,null,null,null,null,null,null,0,0,0,0,0,0,0,0,0,0,0,0,0,null,null,null,null,null,null,null,null,null,null,null,0,0,"E",null,null,null,null,null,null,null,null,null,null,0,0,"E",null,null,null,null,null,null,null,null,null,0,0,"E",null,null,null,null,null,null,null,null,null,null,null,0,0,"E",null,null,null,null,null,null,null,null,null,null,null,0,0,"E",null,null,null,null,null,null,null,null,null,null,0,0,"E",null,null,null,null,null,null,null,null,0,null,0,"E",null,null,null,null,null,null,null,null,null,0,null,0,"E",null,null,null,null,null,null,null,null,null,0,null,0,"E","---","ERR","","----"]
[null,269,null,null,null,null,null,null,null,null,null,null,null,null,null,null,null,null,null,null,null,null,null,null,null,null,null,null,null,null,null,null,0,0,0,0,0,0,0,0,0,0,0,0,0,null,null,null,null,null,null,null,null,null,null,null,0,0,"E",null,null,null,null,null,null,null,null,null,null,0,0,"E",null,null,null,null,null,null,null,null,null,0,0,"E",null,null,null,null,null,null,null,null,null,null,null,0,0,"E",null,null,null,null,null,null,null,null,null,null,null,0,0,"E",null,null,null,null,null,null,null,null,null,null,0,0,"E",null,null,null,null,null,null,null,null,0,null,0,"E",null,null,null,null,null,null,null,null,null,0,null,0,"E",null,null,null,null,null,null,null,null,null,0,null,0,"E","---","ERR","","----"]
[null,270,null,null,null,null,null,null,null,null,null,null,null,null,null,null,null,null,null,null,null,null,null,null,null,null,null,null,null,null,null,null,0,0,0,0,0,0,0,0,0,0,0,0,0,null,null,null,null,null,null,null,null,null,null,null,0,0,"E",null,null,null,null,null,null,null,null,null,null,0,0,"E",null,null,null,null,null,null,null,null,null,0,0,"E",null,null,null,null,null,null,null,null,null,null,null,0,0,"E",null,null,null,null,null,null,null,null,null,null,null,0,0,"E",null,null,null,null,null,null,null,null,null,null,0,0,"E",null,null,null,null,null,null,null,null,0,null,0,"E",null,null,null,null,null,null,null,null,null,0,null,0,"E",null,null,null,null,null,null,null,null,null,0,null,0,"E","---","ERR","","----"]
[null,271,null,null,null,null,null,null,null,null,null,null,null,null,null,null,null,null,null,null,null,null,null,null,null,null,null,null,null,null,null,null,0,0,0,0,0,0,0,0,0,0,0,0,0,null,null,null,null,null,null,null,null,null,null,null,0,0,"E",null,null,null,null,null,null,null,null,null,null,0,0,"E",null,null,null,null,null,null,null,null,null,0,0,"E",null,null,null,null,null,null,null,null,null,null,null,0,0,"E",null,null,null,null,null,null,null,null,null,null,null,0,0,"E",null,null,null,null,null,null,null,null,null,null,0,0,"E",null,null,null,null,null,null,null,null,0,null,0,"E",null,null,null,null,null,null,null,null,null,0,null,0,"E",null,null,null,null,null,null,null,null,null,0,null,0,"E","---","ERR","","----"]
[null,272,null,null,null,null,null,null,null,null,null,null,null,null,null,null,null,null,null,null,null,null,null,null,null,null,null,null,null,null,null,null,0,0,0,0,0,0,0,0,0,0,0,0,0,null,null,null,null,null,null,null,null,null,null,null,0,0,"E",null,null,null,null,null,null,null,null,null,null,0,0,"E",null,null,null,null,null,null,null,null,null,0,0,"E",null,null,null,null,null,null,null,null,null,null,null,0,0,"E",null,null,null,null,null,null,null,null,null,null,null,0,0,"E",null,null,null,null,null,null,null,null,null,null,0,0,"E",null,null,null,null,null,null,null,null,0,null,0,"E",null,null,null,null,null,null,null,null,null,0,null,0,"E",null,null,null,null,null,null,null,null,null,0,null,0,"E","---","ERR","","----"]
[null,273,null,null,null,null,null,null,null,null,null,null,null,null,null,null,null,null,null,null,null,null,null,null,null,null,null,null,null,null,null,null,0,0,0,0,0,0,0,0,0,0,0,0,0,null,null,null,null,null,null,null,null,null,null,null,0,0,"E",null,null,null,null,null,null,null,null,null,null,0,0,"E",null,null,null,null,null,null,null,null,null,0,0,"E",null,null,null,null,null,null,null,null,null,null,null,0,0,"E",null,null,null,null,null,null,null,null,null,null,null,0,0,"E",null,null,null,null,null,null,null,null,null,null,0,0,"E",null,null,null,null,null,null,null,null,0,null,0,"E",null,null,null,null,null,null,null,null,null,0,null,0,"E",null,null,null,null,null,null,null,null,null,0,null,0,"E","---","ERR","","----"]
[null,274,null,null,null,null,null,null,null,null,null,null,null,null,null,null,null,null,null,null,null,null,null,null,null,null,null,null,null,null,null,null,0,0,0,0,0,0,0,0,0,0,0,0,0,null,null,null,null,null,null,null,null,null,null,null,0,0,"E",null,null,null,null,null,null,null,null,null,null,0,0,"E",null,null,null,null,null,null,null,null,null,0,0,"E",null,null,null,null,null,null,null,null,null,null,null,0,0,"E",null,null,null,null,null,null,null,null,null,null,null,0,0,"E",null,null,null,null,null,null,null,null,null,null,0,0,"E",null,null,null,null,null,null,null,null,0,null,0,"E",null,null,null,null,null,null,null,null,null,0,null,0,"E",null,null,null,null,null,null,null,null,null,0,null,0,"E","---","ERR","","----"]
[null,275,null,null,null,null,null,null,null,null,null,null,null,null,null,null,null,null,null,null,null,null,null,null,null,null,null,null,null,null,null,null,0,0,0,0,0,0,0,0,0,0,0,0,0,null,null,null,null,null,null,null,null,null,null,null,0,0,"E",null,null,null,null,null,null,null,null,null,null,0,0,"E",null,null,null,null,null,null,null,null,null,0,0,"E",null,null,null,null,null,null,null,null,null,null,null,0,0,"E",null,null,null,null,null,null,null,null,null,null,null,0,0,"E",null,null,null,null,null,null,null,null,null,null,0,0,"E",null,null,null,null,null,null,null,null,0,null,0,"E",null,null,null,null,null,null,null,null,null,0,null,0,"E",null,null,null,null,null,null,null,null,null,0,null,0,"E","---","ERR","","----"]
[null,276,null,null,null,null,null,null,null,null,null,null,null,null,null,null,null,null,null,null,null,null,null,null,null,null,null,null,null,null,null,null,0,0,0,0,0,0,0,0,0,0,0,0,0,null,null,null,null,null,null,null,null,null,null,null,0,0,"E",null,null,null,null,null,null,null,null,null,null,0,0,"E",null,null,null,null,null,null,null,null,null,0,0,"E",null,null,null,null,null,null,null,null,null,null,null,0,0,"E",null,null,null,null,null,null,null,null,null,null,null,0,0,"E",null,null,null,null,null,null,null,null,null,null,0,0,"E",null,null,null,null,null,null,null,null,0,null,0,"E",null,null,null,null,null,null,null,null,null,0,null,0,"E",null,null,null,null,null,null,null,null,null,0,null,0,"E","---","ERR","","----"]
[null,277,null,null,null,null,null,null,null,null,null,null,null,null,null,null,null,null,null,null,null,null,null,null,null,null,null,null,null,null,null,null,0,0,0,0,0,0,0,0,0,0,0,0,0,null,null,null,null,null,null,null,null,null,null,null,0,0,"E",null,null,null,null,null,null,null,null,null,null,0,0,"E",null,null,null,null,null,null,null,null,null,0,0,"E",null,null,null,null,null,null,null,null,null,null,null,0,0,"E",null,null,null,null,null,null,null,null,null,null,null,0,0,"E",null,null,null,null,null,null,null,null,null,null,0,0,"E",null,null,null,null,null,null,null,null,0,null,0,"E",null,null,null,null,null,null,null,null,null,0,null,0,"E",null,null,null,null,null,null,null,null,null,0,null,0,"E","---","ERR","","----"]
[null,278,null,null,null,null,null,null,null,null,null,null,null,null,null,null,null,null,null,null,null,null,null,null,null,null,null,null,null,null,null,null,0,0,0,0,0,0,0,0,0,0,0,0,0,null,null,null,null,null,null,null,null,null,null,null,0,0,"E",null,null,null,null,null,null,null,null,null,null,0,0,"E",null,null,null,null,null,null,null,null,null,0,0,"E",null,null,null,null,null,null,null,null,null,null,null,0,0,"E",null,null,null,null,null,null,null,null,null,null,null,0,0,"E",null,null,null,null,null,null,null,null,null,null,0,0,"E",null,null,null,null,null,null,null,null,0,null,0,"E",null,null,null,null,null,null,null,null,null,0,null,0,"E",null,null,null,null,null,null,null,null,null,0,null,0,"E","---","ERR","","----"]
[null,279,null,null,null,null,null,null,null,null,null,null,null,null,null,null,null,null,null,null,null,null,null,null,null,null,null,null,null,null,null,null,0,0,0,0,0,0,0,0,0,0,0,0,0,null,null,null,null,null,null,null,null,null,null,null,0,0,"E",null,null,null,null,null,null,null,null,null,null,0,0,"E",null,null,null,null,null,null,null,null,null,0,0,"E",null,null,null,null,null,null,null,null,null,null,null,0,0,"E",null,null,null,null,null,null,null,null,null,null,null,0,0,"E",null,null,null,null,null,null,null,null,null,null,0,0,"E",null,null,null,null,null,null,null,null,0,null,0,"E",null,null,null,null,null,null,null,null,null,0,null,0,"E",null,null,null,null,null,null,null,null,null,0,null,0,"E","---","ERR","","----"]
[null,280,null,null,null,null,null,null,null,null,null,null,null,null,null,null,null,null,null,null,null,null,null,null,null,null,null,null,null,null,null,null,0,0,0,0,0,0,0,0,0,0,0,0,0,null,null,null,null,null,null,null,null,null,null,null,0,0,"E",null,null,null,null,null,null,null,null,null,null,0,0,"E",null,null,null,null,null,null,null,null,null,0,0,"E",null,null,null,null,null,null,null,null,null,null,null,0,0,"E",null,null,null,null,null,null,null,null,null,null,null,0,0,"E",null,null,null,null,null,null,null,null,null,null,0,0,"E",null,null,null,null,null,null,null,null,0,null,0,"E",null,null,null,null,null,null,null,null,null,0,null,0,"E",null,null,null,null,null,null,null,null,null,0,null,0,"E","---","ERR","","----"]
[null,281,null,null,null,null,null,null,null,null,null,null,null,null,null,null,null,null,null,null,null,null,null,null,null,null,null,null,null,null,null,null,0,0,0,0,0,0,0,0,0,0,0,0,0,null,null,null,null,null,null,null,null,null,null,null,0,0,"E",null,null,null,null,null,null,null,null,null,null,0,0,"E",null,null,null,null,null,null,null,null,null,0,0,"E",null,null,null,null,null,null,null,null,null,null,null,0,0,"E",null,null,null,null,null,null,null,null,null,null,null,0,0,"E",null,null,null,null,null,null,null,null,null,null,0,0,"E",null,null,null,null,null,null,null,null,0,null,0,"E",null,null,null,null,null,null,null,null,null,0,null,0,"E",null,null,null,null,null,null,null,null,null,0,null,0,"E","---","ERR","","----"]
[null,282,null,null,null,null,null,null,null,null,null,null,null,null,null,null,null,null,null,null,null,null,null,null,null,null,null,null,null,null,null,null,0,0,0,0,0,0,0,0,0,0,0,0,0,null,null,null,null,null,null,null,null,null,null,null,0,0,"E",null,null,null,null,null,null,null,null,null,null,0,0,"E",null,null,null,null,null,null,null,null,null,0,0,"E",null,null,null,null,null,null,null,null,null,null,null,0,0,"E",null,null,null,null,null,null,null,null,null,null,null,0,0,"E",null,null,null,null,null,null,null,null,null,null,0,0,"E",null,null,null,null,null,null,null,null,0,null,0,"E",null,null,null,null,null,null,null,null,null,0,null,0,"E",null,null,null,null,null,null,null,null,null,0,null,0,"E","---","ERR","","----"]
[null,283,null,null,null,null,null,null,null,null,null,null,null,null,null,null,null,null,null,null,null,null,null,null,null,null,null,null,null,null,null,null,0,0,0,0,0,0,0,0,0,0,0,0,0,null,null,null,null,null,null,null,null,null,null,null,0,0,"E",null,null,null,null,null,null,null,null,null,null,0,0,"E",null,null,null,null,null,null,null,null,null,0,0,"E",null,null,null,null,null,null,null,null,null,null,null,0,0,"E",null,null,null,null,null,null,null,null,null,null,null,0,0,"E",null,null,null,null,null,null,null,null,null,null,0,0,"E",null,null,null,null,null,null,null,null,0,null,0,"E",null,null,null,null,null,null,null,null,null,0,null,0,"E",null,null,null,null,null,null,null,null,null,0,null,0,"E","---","ERR","","----"]
[null,284,null,null,null,null,null,null,null,null,null,null,null,null,null,null,null,null,null,null,null,null,null,null,null,null,null,null,null,null,null,null,0,0,0,0,0,0,0,0,0,0,0,0,0,null,null,null,null,null,null,null,null,null,null,null,0,0,"E",null,null,null,null,null,null,null,null,null,null,0,0,"E",null,null,null,null,null,null,null,null,null,0,0,"E",null,null,null,null,null,null,null,null,null,null,null,0,0,"E",null,null,null,null,null,null,null,null,null,null,null,0,0,"E",null,null,null,null,null,null,null,null,null,null,0,0,"E",null,null,null,null,null,null,null,null,0,null,0,"E",null,null,null,null,null,null,null,null,null,0,null,0,"E",null,null,null,null,null,null,null,null,null,0,null,0,"E","---","ERR","","----"]
[null,285,null,null,null,null,null,null,null,null,null,null,null,null,null,null,null,null,null,null,null,null,null,null,null,null,null,null,null,null,null,null,0,0,0,0,0,0,0,0,0,0,0,0,0,null,null,null,null,null,null,null,null,null,null,null,0,0,"E",null,null,null,null,null,null,null,null,null,null,0,0,"E",null,null,null,null,null,null,null,null,null,0,0,"E",null,null,null,null,null,null,null,null,null,null,null,0,0,"E",null,null,null,null,null,null,null,null,null,null,null,0,0,"E",null,null,null,null,null,null,null,null,null,null,0,0,"E",null,null,null,null,null,null,null,null,0,null,0,"E",null,null,null,null,null,null,null,null,null,0,null,0,"E",null,null,null,null,null,null,null,null,null,0,null,0,"E","---","ERR","","----"]
[null,286,null,null,null,null,null,null,null,null,null,null,null,null,null,null,null,null,null,null,null,null,null,null,null,null,null,null,null,null,null,null,0,0,0,0,0,0,0,0,0,0,0,0,0,null,null,null,null,null,null,null,null,null,null,null,0,0,"E",null,null,null,null,null,null,null,null,null,null,0,0,"E",null,null,null,null,null,null,null,null,null,0,0,"E",null,null,null,null,null,null,null,null,null,null,null,0,0,"E",null,null,null,null,null,null,null,null,null,null,null,0,0,"E",null,null,null,null,null,null,null,null,null,null,0,0,"E",null,null,null,null,null,null,null,null,0,null,0,"E",null,null,null,null,null,null,null,null,null,0,null,0,"E",null,null,null,null,null,null,null,null,null,0,null,0,"E","---","ERR","","----"]
[null,287,null,null,null,null,null,null,null,null,null,null,null,null,null,null,null,null,null,null,null,null,null,null,null,null,null,null,null,null,null,null,0,0,0,0,0,0,0,0,0,0,0,0,0,null,null,null,null,null,null,null,null,null,null,null,0,0,"E",null,null,null,null,null,null,null,null,null,null,0,0,"E",null,null,null,null,null,null,null,null,null,0,0,"E",null,null,null,null,null,null,null,null,null,null,null,0,0,"E",null,null,null,null,null,null,null,null,null,null,null,0,0,"E",null,null,null,null,null,null,null,null,null,null,0,0,"E",null,null,null,null,null,null,null,null,0,null,0,"E",null,null,null,null,null,null,null,null,null,0,null,0,"E",null,null,null,null,null,null,null,null,null,0,null,0,"E","---","ERR","","----"]
[null,288,null,null,null,null,null,null,null,null,null,null,null,null,null,null,null,null,null,null,null,null,null,null,null,null,null,null,null,null,null,null,0,0,0,0,0,0,0,0,0,0,0,0,0,null,null,null,null,null,null,null,null,null,null,null,0,0,"E",null,null,null,null,null,null,null,null,null,null,0,0,"E",null,null,null,null,null,null,null,null,null,0,0,"E",null,null,null,null,null,null,null,null,null,null,null,0,0,"E",null,null,null,null,null,null,null,null,null,null,null,0,0,"E",null,null,null,null,null,null,null,null,null,null,0,0,"E",null,null,null,null,null,null,null,null,0,null,0,"E",null,null,null,null,null,null,null,null,null,0,null,0,"E",null,null,null,null,null,null,null,null,null,0,null,0,"E","---","ERR","","----"]
[null,289,null,null,null,null,null,null,null,null,null,null,null,null,null,null,null,null,null,null,null,null,null,null,null,null,null,null,null,null,null,null,0,0,0,0,0,0,0,0,0,0,0,0,0,null,null,null,null,null,null,null,null,null,null,null,0,0,"E",null,null,null,null,null,null,null,null,null,null,0,0,"E",null,null,null,null,null,null,null,null,null,0,0,"E",null,null,null,null,null,null,null,null,null,null,null,0,0,"E",null,null,null,null,null,null,null,null,null,null,null,0,0,"E",null,null,null,null,null,null,null,null,null,null,0,0,"E",null,null,null,null,null,null,null,null,0,null,0,"E",null,null,null,null,null,null,null,null,null,0,null,0,"E",null,null,null,null,null,null,null,null,null,0,null,0,"E","---","ERR","","----"]
[null,290,null,null,null,null,null,null,null,null,null,null,null,null,null,null,null,null,null,null,null,null,null,null,null,null,null,null,null,null,null,null,0,0,0,0,0,0,0,0,0,0,0,0,0,null,null,null,null,null,null,null,null,null,null,null,0,0,"E",null,null,null,null,null,null,null,null,null,null,0,0,"E",null,null,null,null,null,null,null,null,null,0,0,"E",null,null,null,null,null,null,null,null,null,null,null,0,0,"E",null,null,null,null,null,null,null,null,null,null,null,0,0,"E",null,null,null,null,null,null,null,null,null,null,0,0,"E",null,null,null,null,null,null,null,null,0,null,0,"E",null,null,null,null,null,null,null,null,null,0,null,0,"E",null,null,null,null,null,null,null,null,null,0,null,0,"E","---","ERR","","----"]
[null,291,null,null,null,null,null,null,null,null,null,null,null,null,null,null,null,null,null,null,null,null,null,null,null,null,null,null,null,null,null,null,0,0,0,0,0,0,0,0,0,0,0,0,0,null,null,null,null,null,null,null,null,null,null,null,0,0,"E",null,null,null,null,null,null,null,null,null,null,0,0,"E",null,null,null,null,null,null,null,null,null,0,0,"E",null,null,null,null,null,null,null,null,null,null,null,0,0,"E",null,null,null,null,null,null,null,null,null,null,null,0,0,"E",null,null,null,null,null,null,null,null,null,null,0,0,"E",null,null,null,null,null,null,null,null,0,null,0,"E",null,null,null,null,null,null,null,null,null,0,null,0,"E",null,null,null,null,null,null,null,null,null,0,null,0,"E","---","ERR","","----"]
[null,292,null,null,null,null,null,null,null,null,null,null,null,null,null,null,null,null,null,null,null,null,null,null,null,null,null,null,null,null,null,null,0,0,0,0,0,0,0,0,0,0,0,0,0,null,null,null,null,null,null,null,null,null,null,null,0,0,"E",null,null,null,null,null,null,null,null,null,null,0,0,"E",null,null,null,null,null,null,null,null,null,0,0,"E",null,null,null,null,null,null,null,null,null,null,null,0,0,"E",null,null,null,null,null,null,null,null,null,null,null,0,0,"E",null,null,null,null,null,null,null,null,null,null,0,0,"E",null,null,null,null,null,null,null,null,0,null,0,"E",null,null,null,null,null,null,null,null,null,0,null,0,"E",null,null,null,null,null,null,null,null,null,0,null,0,"E","---","ERR","","----"]
[null,293,null,null,null,null,null,null,null,null,null,null,null,null,null,null,null,null,null,null,null,null,null,null,null,null,null,null,null,null,null,null,0,0,0,0,0,0,0,0,0,0,0,0,0,null,null,null,null,null,null,null,null,null,null,null,0,0,"E",null,null,null,null,null,null,null,null,null,null,0,0,"E",null,null,null,null,null,null,null,null,null,0,0,"E",null,null,null,null,null,null,null,null,null,null,null,0,0,"E",null,null,null,null,null,null,null,null,null,null,null,0,0,"E",null,null,null,null,null,null,null,null,null,null,0,0,"E",null,null,null,null,null,null,null,null,0,null,0,"E",null,null,null,null,null,null,null,null,null,0,null,0,"E",null,null,null,null,null,null,null,null,null,0,null,0,"E","---","ERR","","----"]
[null,294,null,null,null,null,null,null,null,null,null,null,null,null,null,null,null,null,null,null,null,null,null,null,null,null,null,null,null,null,null,null,0,0,0,0,0,0,0,0,0,0,0,0,0,null,null,null,null,null,null,null,null,null,null,null,0,0,"E",null,null,null,null,null,null,null,null,null,null,0,0,"E",null,null,null,null,null,null,null,null,null,0,0,"E",null,null,null,null,null,null,null,null,null,null,null,0,0,"E",null,null,null,null,null,null,null,null,null,null,null,0,0,"E",null,null,null,null,null,null,null,null,null,null,0,0,"E",null,null,null,null,null,null,null,null,0,null,0,"E",null,null,null,null,null,null,null,null,null,0,null,0,"E",null,null,null,null,null,null,null,null,null,0,null,0,"E","---","ERR","","----"]
[null,295,null,null,null,null,null,null,null,null,null,null,null,null,null,null,null,null,null,null,null,null,null,null,null,null,null,null,null,null,null,null,0,0,0,0,0,0,0,0,0,0,0,0,0,null,null,null,null,null,null,null,null,null,null,null,0,0,"E",null,null,null,null,null,null,null,null,null,null,0,0,"E",null,null,null,null,null,null,null,null,null,0,0,"E",null,null,null,null,null,null,null,null,null,null,null,0,0,"E",null,null,null,null,null,null,null,null,null,null,null,0,0,"E",null,null,null,null,null,null,null,null,null,null,0,0,"E",null,null,null,null,null,null,null,null,0,null,0,"E",null,null,null,null,null,null,null,null,null,0,null,0,"E",null,null,null,null,null,null,null,null,null,0,null,0,"E","---","ERR","","----"]
[null,296,null,null,null,null,null,null,null,null,null,null,null,null,null,null,null,null,null,null,null,null,null,null,null,null,null,null,null,null,null,null,0,0,0,0,0,0,0,0,0,0,0,0,0,null,null,null,null,null,null,null,null,null,null,null,0,0,"E",null,null,null,null,null,null,null,null,null,null,0,0,"E",null,null,null,null,null,null,null,null,null,0,0,"E",null,null,null,null,null,null,null,null,null,null,null,0,0,"E",null,null,null,null,null,null,null,null,null,null,null,0,0,"E",null,null,null,null,null,null,null,null,null,null,0,0,"E",null,null,null,null,null,null,null,null,0,null,0,"E",null,null,null,null,null,null,null,null,null,0,null,0,"E",null,null,null,null,null,null,null,null,null,0,null,0,"E","---","ERR","","----"]
[null,297,null,null,null,null,null,null,null,null,null,null,null,null,null,null,null,null,null,null,null,null,null,null,null,null,null,null,null,null,null,null,0,0,0,0,0,0,0,0,0,0,0,0,0,null,null,null,null,null,null,null,null,null,null,null,0,0,"E",null,null,null,null,null,null,null,null,null,null,0,0,"E",null,null,null,null,null,null,null,null,null,0,0,"E",null,null,null,null,null,null,null,null,null,null,null,0,0,"E",null,null,null,null,null,null,null,null,null,null,null,0,0,"E",null,null,null,null,null,null,null,null,null,null,0,0,"E",null,null,null,null,null,null,null,null,0,null,0,"E",null,null,null,null,null,null,null,null,null,0,null,0,"E",null,null,null,null,null,null,null,null,null,0,null,0,"E","---","ERR","","----"]
[null,298,null,null,null,null,null,null,null,null,null,null,null,null,null,null,null,null,null,null,null,null,null,null,null,null,null,null,null,null,null,null,0,0,0,0,0,0,0,0,0,0,0,0,0,null,null,null,null,null,null,null,null,null,null,null,0,0,"E",null,null,null,null,null,null,null,null,null,null,0,0,"E",null,null,null,null,null,null,null,null,null,0,0,"E",null,null,null,null,null,null,null,null,null,null,null,0,0,"E",null,null,null,null,null,null,null,null,null,null,null,0,0,"E",null,null,null,null,null,null,null,null,null,null,0,0,"E",null,null,null,null,null,null,null,null,0,null,0,"E",null,null,null,null,null,null,null,null,null,0,null,0,"E",null,null,null,null,null,null,null,null,null,0,null,0,"E","---","ERR","","----"]
[null,299,null,null,null,null,null,null,null,null,null,null,null,null,null,null,null,null,null,null,null,null,null,null,null,null,null,null,null,null,null,null,0,0,0,0,0,0,0,0,0,0,0,0,0,null,null,null,null,null,null,null,null,null,null,null,0,0,"E",null,null,null,null,null,null,null,null,null,null,0,0,"E",null,null,null,null,null,null,null,null,null,0,0,"E",null,null,null,null,null,null,null,null,null,null,null,0,0,"E",null,null,null,null,null,null,null,null,null,null,null,0,0,"E",null,null,null,null,null,null,null,null,null,null,0,0,"E",null,null,null,null,null,null,null,null,0,null,0,"E",null,null,null,null,null,null,null,null,null,0,null,0,"E",null,null,null,null,null,null,null,null,null,0,null,0,"E","---","ERR","","----"]
[null,300,null,null,null,null,null,null,null,null,null,null,null,null,null,null,null,null,null,null,null,null,null,null,null,null,null,null,null,null,null,null,0,0,0,0,0,0,0,0,0,0,0,0,0,null,null,null,null,null,null,null,null,null,null,null,0,0,"E",null,null,null,null,null,null,null,null,null,null,0,0,"E",null,null,null,null,null,null,null,null,null,0,0,"E",null,null,null,null,null,null,null,null,null,null,null,0,0,"E",null,null,null,null,null,null,null,null,null,null,null,0,0,"E",null,null,null,null,null,null,null,null,null,null,0,0,"E",null,null,null,null,null,null,null,null,0,null,0,"E",null,null,null,null,null,null,null,null,null,0,null,0,"E",null,null,null,null,null,null,null,null,null,0,null,0,"E","---","ERR","","----"]
[null,301,null,null,null,null,null,null,null,null,null,null,null,null,null,null,null,null,null,null,null,null,null,null,null,null,null,null,null,null,null,null,0,0,0,0,0,0,0,0,0,0,0,0,0,null,null,null,null,null,null,null,null,null,null,null,0,0,"E",null,null,null,null,null,null,null,null,null,null,0,0,"E",null,null,null,null,null,null,null,null,null,0,0,"E",null,null,null,null,null,null,null,null,null,null,null,0,0,"E",null,null,null,null,null,null,null,null,null,null,null,0,0,"E",null,null,null,null,null,null,null,null,null,null,0,0,"E",null,null,null,null,null,null,null,null,0,null,0,"E",null,null,null,null,null,null,null,null,null,0,null,0,"E",null,null,null,null,null,null,null,null,null,0,null,0,"E","---","ERR","","----"]
[null,302,null,null,null,null,null,null,null,null,null,null,null,null,null,null,null,null,null,null,null,null,null,null,null,null,null,null,null,null,null,null,0,0,0,0,0,0,0,0,0,0,0,0,0,null,null,null,null,null,null,null,null,null,null,null,0,0,"E",null,null,null,null,null,null,null,null,null,null,0,0,"E",null,null,null,null,null,null,null,null,null,0,0,"E",null,null,null,null,null,null,null,null,null,null,null,0,0,"E",null,null,null,null,null,null,null,null,null,null,null,0,0,"E",null,null,null,null,null,null,null,null,null,null,0,0,"E",null,null,null,null,null,null,null,null,0,null,0,"E",null,null,null,null,null,null,null,null,null,0,null,0,"E",null,null,null,null,null,null,null,null,null,0,null,0,"E","---","ERR","","----"]
[null,303,null,null,null,null,null,null,null,null,null,null,null,null,null,null,null,null,null,null,null,null,null,null,null,null,null,null,null,null,null,null,0,0,0,0,0,0,0,0,0,0,0,0,0,null,null,null,null,null,null,null,null,null,null,null,0,0,"E",null,null,null,null,null,null,null,null,null,null,0,0,"E",null,null,null,null,null,null,null,null,null,0,0,"E",null,null,null,null,null,null,null,null,null,null,null,0,0,"E",null,null,null,null,null,null,null,null,null,null,null,0,0,"E",null,null,null,null,null,null,null,null,null,null,0,0,"E",null,null,null,null,null,null,null,null,0,null,0,"E",null,null,null,null,null,null,null,null,null,0,null,0,"E",null,null,null,null,null,null,null,null,null,0,null,0,"E","---","ERR","","----"]
[null,304,null,null,null,null,null,null,null,null,null,null,null,null,null,null,null,null,null,null,null,null,null,null,null,null,null,null,null,null,null,null,0,0,0,0,0,0,0,0,0,0,0,0,0,null,null,null,null,null,null,null,null,null,null,null,0,0,"E",null,null,null,null,null,null,null,null,null,null,0,0,"E",null,null,null,null,null,null,null,null,null,0,0,"E",null,null,null,null,null,null,null,null,null,null,null,0,0,"E",null,null,null,null,null,null,null,null,null,null,null,0,0,"E",null,null,null,null,null,null,null,null,null,null,0,0,"E",null,null,null,null,null,null,null,null,0,null,0,"E",null,null,null,null,null,null,null,null,null,0,null,0,"E",null,null,null,null,null,null,null,null,null,0,null,0,"E","---","ERR","","----"]
[null,305,null,null,null,null,null,null,null,null,null,null,null,null,null,null,null,null,null,null,null,null,null,null,null,null,null,null,null,null,null,null,0,0,0,0,0,0,0,0,0,0,0,0,0,null,null,null,null,null,null,null,null,null,null,null,0,0,"E",null,null,null,null,null,null,null,null,null,null,0,0,"E",null,null,null,null,null,null,null,null,null,0,0,"E",null,null,null,null,null,null,null,null,null,null,null,0,0,"E",null,null,null,null,null,null,null,null,null,null,null,0,0,"E",null,null,null,null,null,null,null,null,null,null,0,0,"E",null,null,null,null,null,null,null,null,0,null,0,"E",null,null,null,null,null,null,null,null,null,0,null,0,"E",null,null,null,null,null,null,null,null,null,0,null,0,"E","---","ERR","","----"]
[null,306,null,null,null,null,null,null,null,null,null,null,null,null,null,null,null,null,null,null,null,null,null,null,null,null,null,null,null,null,null,null,0,0,0,0,0,0,0,0,0,0,0,0,0,null,null,null,null,null,null,null,null,null,null,null,0,0,"E",null,null,null,null,null,null,null,null,null,null,0,0,"E",null,null,null,null,null,null,null,null,null,0,0,"E",null,null,null,null,null,null,null,null,null,null,null,0,0,"E",null,null,null,null,null,null,null,null,null,null,null,0,0,"E",null,null,null,null,null,null,null,null,null,null,0,0,"E",null,null,null,null,null,null,null,null,0,null,0,"E",null,null,null,null,null,null,null,null,null,0,null,0,"E",null,null,null,null,null,null,null,null,null,0,null,0,"E","---","ERR","","----"]
[null,307,null,null,null,null,null,null,null,null,null,null,null,null,null,null,null,null,null,null,null,null,null,null,null,null,null,null,null,null,null,null,0,0,0,0,0,0,0,0,0,0,0,0,0,null,null,null,null,null,null,null,null,null,null,null,0,0,"E",null,null,null,null,null,null,null,null,null,null,0,0,"E",null,null,null,null,null,null,null,null,null,0,0,"E",null,null,null,null,null,null,null,null,null,null,null,0,0,"E",null,null,null,null,null,null,null,null,null,null,null,0,0,"E",null,null,null,null,null,null,null,null,null,null,0,0,"E",null,null,null,null,null,null,null,null,0,null,0,"E",null,null,null,null,null,null,null,null,null,0,null,0,"E",null,null,null,null,null,null,null,null,null,0,null,0,"E","---","ERR","","----"]
[null,308,null,null,null,null,null,null,null,null,null,null,null,null,null,null,null,null,null,null,null,null,null,null,null,null,null,null,null,null,null,null,0,0,0,0,0,0,0,0,0,0,0,0,0,null,null,null,null,null,null,null,null,null,null,null,0,0,"E",null,null,null,null,null,null,null,null,null,null,0,0,"E",null,null,null,null,null,null,null,null,null,0,0,"E",null,null,null,null,null,null,null,null,null,null,null,0,0,"E",null,null,null,null,null,null,null,null,null,null,null,0,0,"E",null,null,null,null,null,null,null,null,null,null,0,0,"E",null,null,null,null,null,null,null,null,0,null,0,"E",null,null,null,null,null,null,null,null,null,0,null,0,"E",null,null,null,null,null,null,null,null,null,0,null,0,"E","---","ERR","","----"]
[null,309,null,null,null,null,null,null,null,null,null,null,null,null,null,null,null,null,null,null,null,null,null,null,null,null,null,null,null,null,null,null,0,0,0,0,0,0,0,0,0,0,0,0,0,null,null,null,null,null,null,null,null,null,null,null,0,0,"E",null,null,null,null,null,null,null,null,null,null,0,0,"E",null,null,null,null,null,null,null,null,null,0,0,"E",null,null,null,null,null,null,null,null,null,null,null,0,0,"E",null,null,null,null,null,null,null,null,null,null,null,0,0,"E",null,null,null,null,null,null,null,null,null,null,0,0,"E",null,null,null,null,null,null,null,null,0,null,0,"E",null,null,null,null,null,null,null,null,null,0,null,0,"E",null,null,null,null,null,null,null,null,null,0,null,0,"E","---","ERR","","----"]
[null,310,null,null,null,null,null,null,null,null,null,null,null,null,null,null,null,null,null,null,null,null,null,null,null,null,null,null,null,null,null,null,0,0,0,0,0,0,0,0,0,0,0,0,0,null,null,null,null,null,null,null,null,null,null,null,0,0,"E",null,null,null,null,null,null,null,null,null,null,0,0,"E",null,null,null,null,null,null,null,null,null,0,0,"E",null,null,null,null,null,null,null,null,null,null,null,0,0,"E",null,null,null,null,null,null,null,null,null,null,null,0,0,"E",null,null,null,null,null,null,null,null,null,null,0,0,"E",null,null,null,null,null,null,null,null,0,null,0,"E",null,null,null,null,null,null,null,null,null,0,null,0,"E",null,null,null,null,null,null,null,null,null,0,null,0,"E","---","ERR","","----"]
[null,311,null,null,null,null,null,null,null,null,null,null,null,null,null,null,null,null,null,null,null,null,null,null,null,null,null,null,null,null,null,null,0,0,0,0,0,0,0,0,0,0,0,0,0,null,null,null,null,null,null,null,null,null,null,null,0,0,"E",null,null,null,null,null,null,null,null,null,null,0,0,"E",null,null,null,null,null,null,null,null,null,0,0,"E",null,null,null,null,null,null,null,null,null,null,null,0,0,"E",null,null,null,null,null,null,null,null,null,null,null,0,0,"E",null,null,null,null,null,null,null,null,null,null,0,0,"E",null,null,null,null,null,null,null,null,0,null,0,"E",null,null,null,null,null,null,null,null,null,0,null,0,"E",null,null,null,null,null,null,null,null,null,0,null,0,"E","---","ERR","","----"]
[null,312,null,null,null,null,null,null,null,null,null,null,null,null,null,null,null,null,null,null,null,null,null,null,null,null,null,null,null,null,null,null,0,0,0,0,0,0,0,0,0,0,0,0,0,null,null,null,null,null,null,null,null,null,null,null,0,0,"E",null,null,null,null,null,null,null,null,null,null,0,0,"E",null,null,null,null,null,null,null,null,null,0,0,"E",null,null,null,null,null,null,null,null,null,null,null,0,0,"E",null,null,null,null,null,null,null,null,null,null,null,0,0,"E",null,null,null,null,null,null,null,null,null,null,0,0,"E",null,null,null,null,null,null,null,null,0,null,0,"E",null,null,null,null,null,null,null,null,null,0,null,0,"E",null,null,null,null,null,null,null,null,null,0,null,0,"E","---","ERR","","----"]
[null,313,null,null,null,null,null,null,null,null,null,null,null,null,null,null,null,null,null,null,null,null,null,null,null,null,null,null,null,null,null,null,0,0,0,0,0,0,0,0,0,0,0,0,0,null,null,null,null,null,null,null,null,null,null,null,0,0,"E",null,null,null,null,null,null,null,null,null,null,0,0,"E",null,null,null,null,null,null,null,null,null,0,0,"E",null,null,null,null,null,null,null,null,null,null,null,0,0,"E",null,null,null,null,null,null,null,null,null,null,null,0,0,"E",null,null,null,null,null,null,null,null,null,null,0,0,"E",null,null,null,null,null,null,null,null,0,null,0,"E",null,null,null,null,null,null,null,null,null,0,null,0,"E",null,null,null,null,null,null,null,null,null,0,null,0,"E","---","ERR","","----"]
[null,314,null,null,null,null,null,null,null,null,null,null,null,null,null,null,null,null,null,null,null,null,null,null,null,null,null,null,null,null,null,null,0,0,0,0,0,0,0,0,0,0,0,0,0,null,null,null,null,null,null,null,null,null,null,null,0,0,"E",null,null,null,null,null,null,null,null,null,null,0,0,"E",null,null,null,null,null,null,null,null,null,0,0,"E",null,null,null,null,null,null,null,null,null,null,null,0,0,"E",null,null,null,null,null,null,null,null,null,null,null,0,0,"E",null,null,null,null,null,null,null,null,null,null,0,0,"E",null,null,null,null,null,null,null,null,0,null,0,"E",null,null,null,null,null,null,null,null,null,0,null,0,"E",null,null,null,null,null,null,null,null,null,0,null,0,"E","---","ERR","","----"]
[null,315,null,null,null,null,null,null,null,null,null,null,null,null,null,null,null,null,null,null,null,null,null,null,null,null,null,null,null,null,null,null,0,0,0,0,0,0,0,0,0,0,0,0,0,null,null,null,null,null,null,null,null,null,null,null,0,0,"E",null,null,null,null,null,null,null,null,null,null,0,0,"E",null,null,null,null,null,null,null,null,null,0,0,"E",null,null,null,null,null,null,null,null,null,null,null,0,0,"E",null,null,null,null,null,null,null,null,null,null,null,0,0,"E",null,null,null,null,null,null,null,null,null,null,0,0,"E",null,null,null,null,null,null,null,null,0,null,0,"E",null,null,null,null,null,null,null,null,null,0,null,0,"E",null,null,null,null,null,null,null,null,null,0,null,0,"E","---","ERR","","----"]
[null,316,null,null,null,null,null,null,null,null,null,null,null,null,null,null,null,null,null,null,null,null,null,null,null,null,null,null,null,null,null,null,0,0,0,0,0,0,0,0,0,0,0,0,0,null,null,null,null,null,null,null,null,null,null,null,0,0,"E",null,null,null,null,null,null,null,null,null,null,0,0,"E",null,null,null,null,null,null,null,null,null,0,0,"E",null,null,null,null,null,null,null,null,null,null,null,0,0,"E",null,null,null,null,null,null,null,null,null,null,null,0,0,"E",null,null,null,null,null,null,null,null,null,null,0,0,"E",null,null,null,null,null,null,null,null,0,null,0,"E",null,null,null,null,null,null,null,null,null,0,null,0,"E",null,null,null,null,null,null,null,null,null,0,null,0,"E","---","ERR","","----"]
[null,317,null,null,null,null,null,null,null,null,null,null,null,null,null,null,null,null,null,null,null,null,null,null,null,null,null,null,null,null,null,null,0,0,0,0,0,0,0,0,0,0,0,0,0,null,null,null,null,null,null,null,null,null,null,null,0,0,"E",null,null,null,null,null,null,null,null,null,null,0,0,"E",null,null,null,null,null,null,null,null,null,0,0,"E",null,null,null,null,null,null,null,null,null,null,null,0,0,"E",null,null,null,null,null,null,null,null,null,null,null,0,0,"E",null,null,null,null,null,null,null,null,null,null,0,0,"E",null,null,null,null,null,null,null,null,0,null,0,"E",null,null,null,null,null,null,null,null,null,0,null,0,"E",null,null,null,null,null,null,null,null,null,0,null,0,"E","---","ERR","","----"]
[null,318,null,null,null,null,null,null,null,null,null,null,null,null,null,null,null,null,null,null,null,null,null,null,null,null,null,null,null,null,null,null,0,0,0,0,0,0,0,0,0,0,0,0,0,null,null,null,null,null,null,null,null,null,null,null,0,0,"E",null,null,null,null,null,null,null,null,null,null,0,0,"E",null,null,null,null,null,null,null,null,null,0,0,"E",null,null,null,null,null,null,null,null,null,null,null,0,0,"E",null,null,null,null,null,null,null,null,null,null,null,0,0,"E",null,null,null,null,null,null,null,null,null,null,0,0,"E",null,null,null,null,null,null,null,null,0,null,0,"E",null,null,null,null,null,null,null,null,null,0,null,0,"E",null,null,null,null,null,null,null,null,null,0,null,0,"E","---","ERR","","----"]
[null,319,null,null,null,null,null,null,null,null,null,null,null,null,null,null,null,null,null,null,null,null,null,null,null,null,null,null,null,null,null,null,0,0,0,0,0,0,0,0,0,0,0,0,0,null,null,null,null,null,null,null,null,null,null,null,0,0,"E",null,null,null,null,null,null,null,null,null,null,0,0,"E",null,null,null,null,null,null,null,null,null,0,0,"E",null,null,null,null,null,null,null,null,null,null,null,0,0,"E",null,null,null,null,null,null,null,null,null,null,null,0,0,"E",null,null,null,null,null,null,null,null,null,null,0,0,"E",null,null,null,null,null,null,null,null,0,null,0,"E",null,null,null,null,null,null,null,null,null,0,null,0,"E",null,null,null,null,null,null,null,null,null,0,null,0,"E","---","ERR","","----"]
[null,320,null,null,null,null,null,null,null,null,null,null,null,null,null,null,null,null,null,null,null,null,null,null,null,null,null,null,null,null,null,null,0,0,0,0,0,0,0,0,0,0,0,0,0,null,null,null,null,null,null,null,null,null,null,null,0,0,"E",null,null,null,null,null,null,null,null,null,null,0,0,"E",null,null,null,null,null,null,null,null,null,0,0,"E",null,null,null,null,null,null,null,null,null,null,null,0,0,"E",null,null,null,null,null,null,null,null,null,null,null,0,0,"E",null,null,null,null,null,null,null,null,null,null,0,0,"E",null,null,null,null,null,null,null,null,0,null,0,"E",null,null,null,null,null,null,null,null,null,0,null,0,"E",null,null,null,null,null,null,null,null,null,0,null,0,"E","---","ERR","","----"]
[null,321,null,null,null,null,null,null,null,null,null,null,null,null,null,null,null,null,null,null,null,null,null,null,null,null,null,null,null,null,null,null,0,0,0,0,0,0,0,0,0,0,0,0,0,null,null,null,null,null,null,null,null,null,null,null,0,0,"E",null,null,null,null,null,null,null,null,null,null,0,0,"E",null,null,null,null,null,null,null,null,null,0,0,"E",null,null,null,null,null,null,null,null,null,null,null,0,0,"E",null,null,null,null,null,null,null,null,null,null,null,0,0,"E",null,null,null,null,null,null,null,null,null,null,0,0,"E",null,null,null,null,null,null,null,null,0,null,0,"E",null,null,null,null,null,null,null,null,null,0,null,0,"E",null,null,null,null,null,null,null,null,null,0,null,0,"E","---","ERR","","----"]
[null,322,null,null,null,null,null,null,null,null,null,null,null,null,null,null,null,null,null,null,null,null,null,null,null,null,null,null,null,null,null,null,{"$f":"SUM(V328:AF328)","v":0},{"$f":"V328/$V$4","v":0},{"$f":"W328/$W$4","v":0},{"$f":"X328/$X$4","v":0},{"$f":"Y328/$Y$4","v":0},{"$f":"Z328/$Z$4","v":0},{"$f":"AA328/$AA$4","v":0},{"$f":"AB328/$AB$4","v":0},{"$f":"AC328/$AC$4","v":0},{"$f":"AD328/$AD$4","v":0},{"$f":"AE328/$AE$4","v":0},{"$f":"AF328/$AF$4","v":0},{"$f":"AG328/$AG$4","v":0},null,null,null,null,null,null,null,null,null,null,null,{"$f":"SUM(AZ328:BD328)","v":0},{"$f":"BE328+AY328","v":0},{"$f":"IFERROR(IF(BF328>90,\"A+\",IF(BF328>80,\"A\",IF(BF328>70,\"B+\",IF(BF328>60,\"B\",IF(BF328>50,\"C+\",IF(BF328>40,\"C\",IF(BF328>=33,\"D\",\"E\"))))))),\"Abs\")","v":"E"},null,null,null,null,null,null,null,null,null,null,{"$f":"SUM(BM328:BQ328)","v":0},{"$f":"BR328+BL328","v":0},{"$f":"IFERROR(IF(BS328>90,\"A+\",IF(BS328>80,\"A\",IF(BS328>70,\"B+\",IF(BS328>60,\"B\",IF(BS328>50,\"C+\",IF(BS328>40,\"C\",IF(BS328>=33,\"D\",\"E\"))))))),\"Abs\")","v":"E"},null,null,null,null,null,null,null,null,null,{"$f":"SUM(BZ328:CC328)","v":0},{"$f":"CD328+BY328","v":0},{"$f":"IFERROR(IF(CE328>90,\"A+\",IF(CE328>80,\"A\",IF(CE328>70,\"B+\",IF(CE328>60,\"B\",IF(CE328>50,\"C+\",IF(CE328>40,\"C\",IF(CE328>=33,\"D\",\"E\"))))))),\"Abs\")","v":"E"},null,null,null,null,null,null,null,null,null,null,null,{"$f":"SUM(CL328:CQ328)","v":0},{"$f":"CR328+CK328","v":0},{"$f":"IFERROR(IF(CS328>90,\"A+\",IF(CS328>80,\"A\",IF(CS328>70,\"B+\",IF(CS328>60,\"B\",IF(CS328>50,\"C+\",IF(CS328>40,\"C\",IF(CS328>=33,\"D\",\"E\"))))))),\"Abs\")","v":"E"},null,null,null,null,null,null,null,null,null,null,null,{"$f":"SUM(CZ328:DE328)","v":0},{"$f":"DF328+CY328","v":0},{"$f":"IFERROR(IF(DG328>90,\"A+\",IF(DG328>80,\"A\",IF(DG328>70,\"B+\",IF(DG328>60,\"B\",IF(DG328>50,\"C+\",IF(DG328>40,\"C\",IF(DG328>=33,\"D\",\"E\"))))))),\"Abs\")","v":"E"},null,null,null,null,null,null,null,null,null,null,{"$f":"SUM(DN328:DR328)","v":0},{"$f":"DS328+DM328","v":0},{"$f":"IFERROR(IF(DT328>90,\"A+\",IF(DT328>80,\"A\",IF(DT328>70,\"B+\",IF(DT328>60,\"B\",IF(DT328>50,\"C+\",IF(DT328>40,\"C\",IF(DT328>=33,\"D\",\"E\"))))))),\"Abs\")","v":"E"},null,null,null,null,null,null,null,null,{"$f":"SUM(EA328:EC328)","v":0},null,{"$f":"EE328+ED328+DZ328","v":0},{"$f":"IFERROR(IF(EF328>90,\"A+\",IF(EF328>80,\"A\",IF(EF328>70,\"B+\",IF(EF328>60,\"B\",IF(EF328>50,\"C+\",IF(EF328>40,\"C\",IF(EF328>=33,\"D\",\"E\"))))))),\"Abs\")","v":"E"},null,null,null,null,null,null,null,null,null,{"$f":"SUM(EM328:EP328)","v":0},null,{"$f":"ER328+EQ328+EL328","v":0},{"$f":"IFERROR(IF(ES328>90,\"A+\",IF(ES328>80,\"A\",IF(ES328>70,\"B+\",IF(ES328>60,\"B\",IF(ES328>50,\"C+\",IF(ES328>40,\"C\",IF(ES328>=33,\"D\",\"E\"))))))),\"Abs\")","v":"E"},null,null,null,null,null,null,null,null,null,{"$f":"SUM(EZ328:FC328)","v":0},null,{"$f":"FE328+FD328+EY328","v":0},{"$f":"IFERROR(IF(FF328>90,\"A+\",IF(FF328>80,\"A\",IF(FF328>70,\"B+\",IF(FF328>60,\"B\",IF(FF328>50,\"C+\",IF(FF328>40,\"C\",IF(FF328>=33,\"D\",\"E\"))))))),\"Abs\")","v":"E"},{"$f":"IF(AND(MIN(AY328,BL328,BY328,CK328,CY328,DM328)>19,MIN(BF328,BS328,CE328,CS328,DG328,DT328)>32),SUM(BF328,BS328,CE328,CS328,DG328,DT328),\"---\")","v":"---"},{"$f":"IFERROR(FH328/600*100,\"ERR\")","v":"ERR"},{"$f":"IF(FI328=\"ERR\",\"\",(IF(FI328>90,\"A+\",IF(FI328>80,\"A\",IF(FI328>70,\"B+\",IF(FI328>60,\"B\",IF(FI328>50,\"C+\",IF(FI328>40,\"C\",IF(FI328>=33,\"D\",IF(FI328<33,\"E\",\"\"))))))))))","v":""},{"$f":"IF(FI328=\"ERR\",\"----\",IF(FI328>=33,\"ਪਾਸ\",\"--\"))","v":"----"}]
[null,323,null,null,null,null,null,null,null,null,null,null,null,null,null,null,null,null,null,null,null,null,null,null,null,null,null,null,null,null,null,null,0,0,0,0,0,0,0,0,0,0,0,0,0,null,null,null,null,null,null,null,null,null,null,null,0,0,"E",null,null,null,null,null,null,null,null,null,null,0,0,"E",null,null,null,null,null,null,null,null,null,0,0,"E",null,null,null,null,null,null,null,null,null,null,null,0,0,"E",null,null,null,null,null,null,null,null,null,null,null,0,0,"E",null,null,null,null,null,null,null,null,null,null,0,0,"E",null,null,null,null,null,null,null,null,0,null,0,"E",null,null,null,null,null,null,null,null,null,0,null,0,"E",null,null,null,null,null,null,null,null,null,0,null,0,"E","---","ERR","","----"]
[null,324,null,null,null,null,null,null,null,null,null,null,null,null,null,null,null,null,null,null,null,null,null,null,null,null,null,null,null,null,null,null,0,0,0,0,0,0,0,0,0,0,0,0,0,null,null,null,null,null,null,null,null,null,null,null,0,0,"E",null,null,null,null,null,null,null,null,null,null,0,0,"E",null,null,null,null,null,null,null,null,null,0,0,"E",null,null,null,null,null,null,null,null,null,null,null,0,0,"E",null,null,null,null,null,null,null,null,null,null,null,0,0,"E",null,null,null,null,null,null,null,null,null,null,0,0,"E",null,null,null,null,null,null,null,null,0,null,0,"E",null,null,null,null,null,null,null,null,null,0,null,0,"E",null,null,null,null,null,null,null,null,null,0,null,0,"E","---","ERR","","----"]
[null,325,null,null,null,null,null,null,null,null,null,null,null,null,null,null,null,null,null,null,null,null,null,null,null,null,null,null,null,null,null,null,0,0,0,0,0,0,0,0,0,0,0,0,0,null,null,null,null,null,null,null,null,null,null,null,0,0,"E",null,null,null,null,null,null,null,null,null,null,0,0,"E",null,null,null,null,null,null,null,null,null,0,0,"E",null,null,null,null,null,null,null,null,null,null,null,0,0,"E",null,null,null,null,null,null,null,null,null,null,null,0,0,"E",null,null,null,null,null,null,null,null,null,null,0,0,"E",null,null,null,null,null,null,null,null,0,null,0,"E",null,null,null,null,null,null,null,null,null,0,null,0,"E",null,null,null,null,null,null,null,null,null,0,null,0,"E","---","ERR","","----"]
[null,326,null,null,null,null,null,null,null,null,null,null,null,null,null,null,null,null,null,null,null,null,null,null,null,null,null,null,null,null,null,null,0,0,0,0,0,0,0,0,0,0,0,0,0,null,null,null,null,null,null,null,null,null,null,null,0,0,"E",null,null,null,null,null,null,null,null,null,null,0,0,"E",null,null,null,null,null,null,null,null,null,0,0,"E",null,null,null,null,null,null,null,null,null,null,null,0,0,"E",null,null,null,null,null,null,null,null,null,null,null,0,0,"E",null,null,null,null,null,null,null,null,null,null,0,0,"E",null,null,null,null,null,null,null,null,0,null,0,"E",null,null,null,null,null,null,null,null,null,0,null,0,"E",null,null,null,null,null,null,null,null,null,0,null,0,"E","---","ERR","","----"]
[null,327,null,null,null,null,null,null,null,null,null,null,null,null,null,null,null,null,null,null,null,null,null,null,null,null,null,null,null,null,null,null,0,0,0,0,0,0,0,0,0,0,0,0,0,null,null,null,null,null,null,null,null,null,null,null,0,0,"E",null,null,null,null,null,null,null,null,null,null,0,0,"E",null,null,null,null,null,null,null,null,null,0,0,"E",null,null,null,null,null,null,null,null,null,null,null,0,0,"E",null,null,null,null,null,null,null,null,null,null,null,0,0,"E",null,null,null,null,null,null,null,null,null,null,0,0,"E",null,null,null,null,null,null,null,null,0,null,0,"E",null,null,null,null,null,null,null,null,null,0,null,0,"E",null,null,null,null,null,null,null,null,null,0,null,0,"E","---","ERR","","----"]
[null,328,null,null,null,null,null,null,null,null,null,null,null,null,null,null,null,null,null,null,null,null,null,null,null,null,null,null,null,null,null,null,0,0,0,0,0,0,0,0,0,0,0,0,0,null,null,null,null,null,null,null,null,null,null,null,0,0,"E",null,null,null,null,null,null,null,null,null,null,0,0,"E",null,null,null,null,null,null,null,null,null,0,0,"E",null,null,null,null,null,null,null,null,null,null,null,0,0,"E",null,null,null,null,null,null,null,null,null,null,null,0,0,"E",null,null,null,null,null,null,null,null,null,null,0,0,"E",null,null,null,null,null,null,null,null,0,null,0,"E",null,null,null,null,null,null,null,null,null,0,null,0,"E",null,null,null,null,null,null,null,null,null,0,null,0,"E","---","ERR","","----"]
[null,329,null,null,null,null,null,null,null,null,null,null,null,null,null,null,null,null,null,null,null,null,null,null,null,null,null,null,null,null,null,null,0,0,0,0,0,0,0,0,0,0,0,0,0,null,null,null,null,null,null,null,null,null,null,null,0,0,"E",null,null,null,null,null,null,null,null,null,null,0,0,"E",null,null,null,null,null,null,null,null,null,0,0,"E",null,null,null,null,null,null,null,null,null,null,null,0,0,"E",null,null,null,null,null,null,null,null,null,null,null,0,0,"E",null,null,null,null,null,null,null,null,null,null,0,0,"E",null,null,null,null,null,null,null,null,0,null,0,"E",null,null,null,null,null,null,null,null,null,0,null,0,"E",null,null,null,null,null,null,null,null,null,0,null,0,"E","---","ERR","","----"]
[null,330,null,null,null,null,null,null,null,null,null,null,null,null,null,null,null,null,null,null,null,null,null,null,null,null,null,null,null,null,null,null,0,0,0,0,0,0,0,0,0,0,0,0,0,null,null,null,null,null,null,null,null,null,null,null,0,0,"E",null,null,null,null,null,null,null,null,null,null,0,0,"E",null,null,null,null,null,null,null,null,null,0,0,"E",null,null,null,null,null,null,null,null,null,null,null,0,0,"E",null,null,null,null,null,null,null,null,null,null,null,0,0,"E",null,null,null,null,null,null,null,null,null,null,0,0,"E",null,null,null,null,null,null,null,null,0,null,0,"E",null,null,null,null,null,null,null,null,null,0,null,0,"E",null,null,null,null,null,null,null,null,null,0,null,0,"E","---","ERR","","----"]
[null,331,null,null,null,null,null,null,null,null,null,null,null,null,null,null,null,null,null,null,null,null,null,null,null,null,null,null,null,null,null,null,0,0,0,0,0,0,0,0,0,0,0,0,0,null,null,null,null,null,null,null,null,null,null,null,0,0,"E",null,null,null,null,null,null,null,null,null,null,0,0,"E",null,null,null,null,null,null,null,null,null,0,0,"E",null,null,null,null,null,null,null,null,null,null,null,0,0,"E",null,null,null,null,null,null,null,null,null,null,null,0,0,"E",null,null,null,null,null,null,null,null,null,null,0,0,"E",null,null,null,null,null,null,null,null,0,null,0,"E",null,null,null,null,null,null,null,null,null,0,null,0,"E",null,null,null,null,null,null,null,null,null,0,null,0,"E","---","ERR","","----"]
[null,332,null,null,null,null,null,null,null,null,null,null,null,null,null,null,null,null,null,null,null,null,null,null,null,null,null,null,null,null,null,null,0,0,0,0,0,0,0,0,0,0,0,0,0,null,null,null,null,null,null,null,null,null,null,null,0,0,"E",null,null,null,null,null,null,null,null,null,null,0,0,"E",null,null,null,null,null,null,null,null,null,0,0,"E",null,null,null,null,null,null,null,null,null,null,null,0,0,"E",null,null,null,null,null,null,null,null,null,null,null,0,0,"E",null,null,null,null,null,null,null,null,null,null,0,0,"E",null,null,null,null,null,null,null,null,0,null,0,"E",null,null,null,null,null,null,null,null,null,0,null,0,"E",null,null,null,null,null,null,null,null,null,0,null,0,"E","---","ERR","","----"]
[null,333,null,null,null,null,null,null,null,null,null,null,null,null,null,null,null,null,null,null,null,null,null,null,null,null,null,null,null,null,null,null,0,0,0,0,0,0,0,0,0,0,0,0,0,null,null,null,null,null,null,null,null,null,null,null,0,0,"E",null,null,null,null,null,null,null,null,null,null,0,0,"E",null,null,null,null,null,null,null,null,null,0,0,"E",null,null,null,null,null,null,null,null,null,null,null,0,0,"E",null,null,null,null,null,null,null,null,null,null,null,0,0,"E",null,null,null,null,null,null,null,null,null,null,0,0,"E",null,null,null,null,null,null,null,null,0,null,0,"E",null,null,null,null,null,null,null,null,null,0,null,0,"E",null,null,null,null,null,null,null,null,null,0,null,0,"E","---","ERR","","----"]
[null,334,null,null,null,null,null,null,null,null,null,null,null,null,null,null,null,null,null,null,null,null,null,null,null,null,null,null,null,null,null,null,0,0,0,0,0,0,0,0,0,0,0,0,0,null,null,null,null,null,null,null,null,null,null,null,0,0,"E",null,null,null,null,null,null,null,null,null,null,0,0,"E",null,null,null,null,null,null,null,null,null,0,0,"E",null,null,null,null,null,null,null,null,null,null,null,0,0,"E",null,null,null,null,null,null,null,null,null,null,null,0,0,"E",null,null,null,null,null,null,null,null,null,null,0,0,"E",null,null,null,null,null,null,null,null,0,null,0,"E",null,null,null,null,null,null,null,null,null,0,null,0,"E",null,null,null,null,null,null,null,null,null,0,null,0,"E","---","ERR","","----"]
[null,335,null,null,null,null,null,null,null,null,null,null,null,null,null,null,null,null,null,null,null,null,null,null,null,null,null,null,null,null,null,null,0,0,0,0,0,0,0,0,0,0,0,0,0,null,null,null,null,null,null,null,null,null,null,null,0,0,"E",null,null,null,null,null,null,null,null,null,null,0,0,"E",null,null,null,null,null,null,null,null,null,0,0,"E",null,null,null,null,null,null,null,null,null,null,null,0,0,"E",null,null,null,null,null,null,null,null,null,null,null,0,0,"E",null,null,null,null,null,null,null,null,null,null,0,0,"E",null,null,null,null,null,null,null,null,0,null,0,"E",null,null,null,null,null,null,null,null,null,0,null,0,"E",null,null,null,null,null,null,null,null,null,0,null,0,"E","---","ERR","","----"]
[null,336,null,null,null,null,null,null,null,null,null,null,null,null,null,null,null,null,null,null,null,null,null,null,null,null,null,null,null,null,null,null,0,0,0,0,0,0,0,0,0,0,0,0,0,null,null,null,null,null,null,null,null,null,null,null,0,0,"E",null,null,null,null,null,null,null,null,null,null,0,0,"E",null,null,null,null,null,null,null,null,null,0,0,"E",null,null,null,null,null,null,null,null,null,null,null,0,0,"E",null,null,null,null,null,null,null,null,null,null,null,0,0,"E",null,null,null,null,null,null,null,null,null,null,0,0,"E",null,null,null,null,null,null,null,null,0,null,0,"E",null,null,null,null,null,null,null,null,null,0,null,0,"E",null,null,null,null,null,null,null,null,null,0,null,0,"E","---","ERR","","----"]
[null,337,null,null,null,null,null,null,null,null,null,null,null,null,null,null,null,null,null,null,null,null,null,null,null,null,null,null,null,null,null,null,0,0,0,0,0,0,0,0,0,0,0,0,0,null,null,null,null,null,null,null,null,null,null,null,0,0,"E",null,null,null,null,null,null,null,null,null,null,0,0,"E",null,null,null,null,null,null,null,null,null,0,0,"E",null,null,null,null,null,null,null,null,null,null,null,0,0,"E",null,null,null,null,null,null,null,null,null,null,null,0,0,"E",null,null,null,null,null,null,null,null,null,null,0,0,"E",null,null,null,null,null,null,null,null,0,null,0,"E",null,null,null,null,null,null,null,null,null,0,null,0,"E",null,null,null,null,null,null,null,null,null,0,null,0,"E","---","ERR","","----"]
[null,338,null,null,null,null,null,null,null,null,null,null,null,null,null,null,null,null,null,null,null,null,null,null,null,null,null,null,null,null,null,null,0,0,0,0,0,0,0,0,0,0,0,0,0,null,null,null,null,null,null,null,null,null,null,null,0,0,"E",null,null,null,null,null,null,null,null,null,null,0,0,"E",null,null,null,null,null,null,null,null,null,0,0,"E",null,null,null,null,null,null,null,null,null,null,null,0,0,"E",null,null,null,null,null,null,null,null,null,null,null,0,0,"E",null,null,null,null,null,null,null,null,null,null,0,0,"E",null,null,null,null,null,null,null,null,0,null,0,"E",null,null,null,null,null,null,null,null,null,0,null,0,"E",null,null,null,null,null,null,null,null,null,0,null,0,"E","---","ERR","","----"]
[null,339,null,null,null,null,null,null,null,null,null,null,null,null,null,null,null,null,null,null,null,null,null,null,null,null,null,null,null,null,null,null,0,0,0,0,0,0,0,0,0,0,0,0,0,null,null,null,null,null,null,null,null,null,null,null,0,0,"E",null,null,null,null,null,null,null,null,null,null,0,0,"E",null,null,null,null,null,null,null,null,null,0,0,"E",null,null,null,null,null,null,null,null,null,null,null,0,0,"E",null,null,null,null,null,null,null,null,null,null,null,0,0,"E",null,null,null,null,null,null,null,null,null,null,0,0,"E",null,null,null,null,null,null,null,null,0,null,0,"E",null,null,null,null,null,null,null,null,null,0,null,0,"E",null,null,null,null,null,null,null,null,null,0,null,0,"E","---","ERR","","----"]
[null,340,null,null,null,null,null,null,null,null,null,null,null,null,null,null,null,null,null,null,null,null,null,null,null,null,null,null,null,null,null,null,0,0,0,0,0,0,0,0,0,0,0,0,0,null,null,null,null,null,null,null,null,null,null,null,0,0,"E",null,null,null,null,null,null,null,null,null,null,0,0,"E",null,null,null,null,null,null,null,null,null,0,0,"E",null,null,null,null,null,null,null,null,null,null,null,0,0,"E",null,null,null,null,null,null,null,null,null,null,null,0,0,"E",null,null,null,null,null,null,null,null,null,null,0,0,"E",null,null,null,null,null,null,null,null,0,null,0,"E",null,null,null,null,null,null,null,null,null,0,null,0,"E",null,null,null,null,null,null,null,null,null,0,null,0,"E","---","ERR","","----"]
[null,341,null,null,null,null,null,null,null,null,null,null,null,null,null,null,null,null,null,null,null,null,null,null,null,null,null,null,null,null,null,null,0,0,0,0,0,0,0,0,0,0,0,0,0,null,null,null,null,null,null,null,null,null,null,null,0,0,"E",null,null,null,null,null,null,null,null,null,null,0,0,"E",null,null,null,null,null,null,null,null,null,0,0,"E",null,null,null,null,null,null,null,null,null,null,null,0,0,"E",null,null,null,null,null,null,null,null,null,null,null,0,0,"E",null,null,null,null,null,null,null,null,null,null,0,0,"E",null,null,null,null,null,null,null,null,0,null,0,"E",null,null,null,null,null,null,null,null,null,0,null,0,"E",null,null,null,null,null,null,null,null,null,0,null,0,"E","---","ERR","","----"]
[null,342,null,null,null,null,null,null,null,null,null,null,null,null,null,null,null,null,null,null,null,null,null,null,null,null,null,null,null,null,null,null,0,0,0,0,0,0,0,0,0,0,0,0,0,null,null,null,null,null,null,null,null,null,null,null,0,0,"E",null,null,null,null,null,null,null,null,null,null,0,0,"E",null,null,null,null,null,null,null,null,null,0,0,"E",null,null,null,null,null,null,null,null,null,null,null,0,0,"E",null,null,null,null,null,null,null,null,null,null,null,0,0,"E",null,null,null,null,null,null,null,null,null,null,0,0,"E",null,null,null,null,null,null,null,null,0,null,0,"E",null,null,null,null,null,null,null,null,null,0,null,0,"E",null,null,null,null,null,null,null,null,null,0,null,0,"E","---","ERR","","----"]
[null,343,null,null,null,null,null,null,null,null,null,null,null,null,null,null,null,null,null,null,null,null,null,null,null,null,null,null,null,null,null,null,0,0,0,0,0,0,0,0,0,0,0,0,0,null,null,null,null,null,null,null,null,null,null,null,0,0,"E",null,null,null,null,null,null,null,null,null,null,0,0,"E",null,null,null,null,null,null,null,null,null,0,0,"E",null,null,null,null,null,null,null,null,null,null,null,0,0,"E",null,null,null,null,null,null,null,null,null,null,null,0,0,"E",null,null,null,null,null,null,null,null,null,null,0,0,"E",null,null,null,null,null,null,null,null,0,null,0,"E",null,null,null,null,null,null,null,null,null,0,null,0,"E",null,null,null,null,null,null,null,null,null,0,null,0,"E","---","ERR","","----"]
[null,344,null,null,null,null,null,null,null,null,null,null,null,null,null,null,null,null,null,null,null,null,null,null,null,null,null,null,null,null,null,null,0,0,0,0,0,0,0,0,0,0,0,0,0,null,null,null,null,null,null,null,null,null,null,null,0,0,"E",null,null,null,null,null,null,null,null,null,null,0,0,"E",null,null,null,null,null,null,null,null,null,0,0,"E",null,null,null,null,null,null,null,null,null,null,null,0,0,"E",null,null,null,null,null,null,null,null,null,null,null,0,0,"E",null,null,null,null,null,null,null,null,null,null,0,0,"E",null,null,null,null,null,null,null,null,0,null,0,"E",null,null,null,null,null,null,null,null,null,0,null,0,"E",null,null,null,null,null,null,null,null,null,0,null,0,"E","---","ERR","","----"]
[null,345,null,null,null,null,null,null,null,null,null,null,null,null,null,null,null,null,null,null,null,null,null,null,null,null,null,null,null,null,null,null,0,0,0,0,0,0,0,0,0,0,0,0,0,null,null,null,null,null,null,null,null,null,null,null,0,0,"E",null,null,null,null,null,null,null,null,null,null,0,0,"E",null,null,null,null,null,null,null,null,null,0,0,"E",null,null,null,null,null,null,null,null,null,null,null,0,0,"E",null,null,null,null,null,null,null,null,null,null,null,0,0,"E",null,null,null,null,null,null,null,null,null,null,0,0,"E",null,null,null,null,null,null,null,null,0,null,0,"E",null,null,null,null,null,null,null,null,null,0,null,0,"E",null,null,null,null,null,null,null,null,null,0,null,0,"E","---","ERR","","----"]
[null,346,null,null,null,null,null,null,null,null,null,null,null,null,null,null,null,null,null,null,null,null,null,null,null,null,null,null,null,null,null,null,0,0,0,0,0,0,0,0,0,0,0,0,0,null,null,null,null,null,null,null,null,null,null,null,0,0,"E",null,null,null,null,null,null,null,null,null,null,0,0,"E",null,null,null,null,null,null,null,null,null,0,0,"E",null,null,null,null,null,null,null,null,null,null,null,0,0,"E",null,null,null,null,null,null,null,null,null,null,null,0,0,"E",null,null,null,null,null,null,null,null,null,null,0,0,"E",null,null,null,null,null,null,null,null,0,null,0,"E",null,null,null,null,null,null,null,null,null,0,null,0,"E",null,null,null,null,null,null,null,null,null,0,null,0,"E","---","ERR","","----"]
[null,347,null,null,null,null,null,null,null,null,null,null,null,null,null,null,null,null,null,null,null,null,null,null,null,null,null,null,null,null,null,null,0,0,0,0,0,0,0,0,0,0,0,0,0,null,null,null,null,null,null,null,null,null,null,null,0,0,"E",null,null,null,null,null,null,null,null,null,null,0,0,"E",null,null,null,null,null,null,null,null,null,0,0,"E",null,null,null,null,null,null,null,null,null,null,null,0,0,"E",null,null,null,null,null,null,null,null,null,null,null,0,0,"E",null,null,null,null,null,null,null,null,null,null,0,0,"E",null,null,null,null,null,null,null,null,0,null,0,"E",null,null,null,null,null,null,null,null,null,0,null,0,"E",null,null,null,null,null,null,null,null,null,0,null,0,"E","---","ERR","","----"]
[null,348,null,null,null,null,null,null,null,null,null,null,null,null,null,null,null,null,null,null,null,null,null,null,null,null,null,null,null,null,null,null,0,0,0,0,0,0,0,0,0,0,0,0,0,null,null,null,null,null,null,null,null,null,null,null,0,0,"E",null,null,null,null,null,null,null,null,null,null,0,0,"E",null,null,null,null,null,null,null,null,null,0,0,"E",null,null,null,null,null,null,null,null,null,null,null,0,0,"E",null,null,null,null,null,null,null,null,null,null,null,0,0,"E",null,null,null,null,null,null,null,null,null,null,0,0,"E",null,null,null,null,null,null,null,null,0,null,0,"E",null,null,null,null,null,null,null,null,null,0,null,0,"E",null,null,null,null,null,null,null,null,null,0,null,0,"E","---","ERR","","----"]
[null,349,null,null,null,null,null,null,null,null,null,null,null,null,null,null,null,null,null,null,null,null,null,null,null,null,null,null,null,null,null,null,0,0,0,0,0,0,0,0,0,0,0,0,0,null,null,null,null,null,null,null,null,null,null,null,0,0,"E",null,null,null,null,null,null,null,null,null,null,0,0,"E",null,null,null,null,null,null,null,null,null,0,0,"E",null,null,null,null,null,null,null,null,null,null,null,0,0,"E",null,null,null,null,null,null,null,null,null,null,null,0,0,"E",null,null,null,null,null,null,null,null,null,null,0,0,"E",null,null,null,null,null,null,null,null,0,null,0,"E",null,null,null,null,null,null,null,null,null,0,null,0,"E",null,null,null,null,null,null,null,null,null,0,null,0,"E","---","ERR","","----"]
[null,350,null,null,null,null,null,null,null,null,null,null,null,null,null,null,null,null,null,null,null,null,null,null,null,null,null,null,null,null,null,null,0,0,0,0,0,0,0,0,0,0,0,0,0,null,null,null,null,null,null,null,null,null,null,null,0,0,"E",null,null,null,null,null,null,null,null,null,null,0,0,"E",null,null,null,null,null,null,null,null,null,0,0,"E",null,null,null,null,null,null,null,null,null,null,null,0,0,"E",null,null,null,null,null,null,null,null,null,null,null,0,0,"E",null,null,null,null,null,null,null,null,null,null,0,0,"E",null,null,null,null,null,null,null,null,0,null,0,"E",null,null,null,null,null,null,null,null,null,0,null,0,"E",null,null,null,null,null,null,null,null,null,0,null,0,"E","---","ERR","","----"]
[null,351,null,null,null,null,null,null,null,null,null,null,null,null,null,null,null,null,null,null,null,null,null,null,null,null,null,null,null,null,null,null,0,0,0,0,0,0,0,0,0,0,0,0,0,null,null,null,null,null,null,null,null,null,null,null,0,0,"E",null,null,null,null,null,null,null,null,null,null,0,0,"E",null,null,null,null,null,null,null,null,null,0,0,"E",null,null,null,null,null,null,null,null,null,null,null,0,0,"E",null,null,null,null,null,null,null,null,null,null,null,0,0,"E",null,null,null,null,null,null,null,null,null,null,0,0,"E",null,null,null,null,null,null,null,null,0,null,0,"E",null,null,null,null,null,null,null,null,null,0,null,0,"E",null,null,null,null,null,null,null,null,null,0,null,0,"E","---","ERR","","----"]
[null,352,null,null,null,null,null,null,null,null,null,null,null,null,null,null,null,null,null,null,null,null,null,null,null,null,null,null,null,null,null,null,0,0,0,0,0,0,0,0,0,0,0,0,0,null,null,null,null,null,null,null,null,null,null,null,0,0,"E",null,null,null,null,null,null,null,null,null,null,0,0,"E",null,null,null,null,null,null,null,null,null,0,0,"E",null,null,null,null,null,null,null,null,null,null,null,0,0,"E",null,null,null,null,null,null,null,null,null,null,null,0,0,"E",null,null,null,null,null,null,null,null,null,null,0,0,"E",null,null,null,null,null,null,null,null,0,null,0,"E",null,null,null,null,null,null,null,null,null,0,null,0,"E",null,null,null,null,null,null,null,null,null,0,null,0,"E","---","ERR","","----"]
[null,353,null,null,null,null,null,null,null,null,null,null,null,null,null,null,null,null,null,null,null,null,null,null,null,null,null,null,null,null,null,null,0,0,0,0,0,0,0,0,0,0,0,0,0,null,null,null,null,null,null,null,null,null,null,null,0,0,"E",null,null,null,null,null,null,null,null,null,null,0,0,"E",null,null,null,null,null,null,null,null,null,0,0,"E",null,null,null,null,null,null,null,null,null,null,null,0,0,"E",null,null,null,null,null,null,null,null,null,null,null,0,0,"E",null,null,null,null,null,null,null,null,null,null,0,0,"E",null,null,null,null,null,null,null,null,0,null,0,"E",null,null,null,null,null,null,null,null,null,0,null,0,"E",null,null,null,null,null,null,null,null,null,0,null,0,"E","---","ERR","","----"]
[null,354,null,null,null,null,null,null,null,null,null,null,null,null,null,null,null,null,null,null,null,null,null,null,null,null,null,null,null,null,null,null,0,0,0,0,0,0,0,0,0,0,0,0,0,null,null,null,null,null,null,null,null,null,null,null,0,0,"E",null,null,null,null,null,null,null,null,null,null,0,0,"E",null,null,null,null,null,null,null,null,null,0,0,"E",null,null,null,null,null,null,null,null,null,null,null,0,0,"E",null,null,null,null,null,null,null,null,null,null,null,0,0,"E",null,null,null,null,null,null,null,null,null,null,0,0,"E",null,null,null,null,null,null,null,null,0,null,0,"E",null,null,null,null,null,null,null,null,null,0,null,0,"E",null,null,null,null,null,null,null,null,null,0,null,0,"E","---","ERR","","----"]
[null,355,null,null,null,null,null,null,null,null,null,null,null,null,null,null,null,null,null,null,null,null,null,null,null,null,null,null,null,null,null,null,0,0,0,0,0,0,0,0,0,0,0,0,0,null,null,null,null,null,null,null,null,null,null,null,0,0,"E",null,null,null,null,null,null,null,null,null,null,0,0,"E",null,null,null,null,null,null,null,null,null,0,0,"E",null,null,null,null,null,null,null,null,null,null,null,0,0,"E",null,null,null,null,null,null,null,null,null,null,null,0,0,"E",null,null,null,null,null,null,null,null,null,null,0,0,"E",null,null,null,null,null,null,null,null,0,null,0,"E",null,null,null,null,null,null,null,null,null,0,null,0,"E",null,null,null,null,null,null,null,null,null,0,null,0,"E","---","ERR","","----"]
[null,356,null,null,null,null,null,null,null,null,null,null,null,null,null,null,null,null,null,null,null,null,null,null,null,null,null,null,null,null,null,null,0,0,0,0,0,0,0,0,0,0,0,0,0,null,null,null,null,null,null,null,null,null,null,null,0,0,"E",null,null,null,null,null,null,null,null,null,null,0,0,"E",null,null,null,null,null,null,null,null,null,0,0,"E",null,null,null,null,null,null,null,null,null,null,null,0,0,"E",null,null,null,null,null,null,null,null,null,null,null,0,0,"E",null,null,null,null,null,null,null,null,null,null,0,0,"E",null,null,null,null,null,null,null,null,0,null,0,"E",null,null,null,null,null,null,null,null,null,0,null,0,"E",null,null,null,null,null,null,null,null,null,0,null,0,"E","---","ERR","","----"]
[null,357,null,null,null,null,null,null,null,null,null,null,null,null,null,null,null,null,null,null,null,null,null,null,null,null,null,null,null,null,null,null,0,0,0,0,0,0,0,0,0,0,0,0,0,null,null,null,null,null,null,null,null,null,null,null,0,0,"E",null,null,null,null,null,null,null,null,null,null,0,0,"E",null,null,null,null,null,null,null,null,null,0,0,"E",null,null,null,null,null,null,null,null,null,null,null,0,0,"E",null,null,null,null,null,null,null,null,null,null,null,0,0,"E",null,null,null,null,null,null,null,null,null,null,0,0,"E",null,null,null,null,null,null,null,null,0,null,0,"E",null,null,null,null,null,null,null,null,null,0,null,0,"E",null,null,null,null,null,null,null,null,null,0,null,0,"E","---","ERR","","----"]
[null,358,null,null,null,null,null,null,null,null,null,null,null,null,null,null,null,null,null,null,null,null,null,null,null,null,null,null,null,null,null,null,0,0,0,0,0,0,0,0,0,0,0,0,0,null,null,null,null,null,null,null,null,null,null,null,0,0,"E",null,null,null,null,null,null,null,null,null,null,0,0,"E",null,null,null,null,null,null,null,null,null,0,0,"E",null,null,null,null,null,null,null,null,null,null,null,0,0,"E",null,null,null,null,null,null,null,null,null,null,null,0,0,"E",null,null,null,null,null,null,null,null,null,null,0,0,"E",null,null,null,null,null,null,null,null,0,null,0,"E",null,null,null,null,null,null,null,null,null,0,null,0,"E",null,null,null,null,null,null,null,null,null,0,null,0,"E","---","ERR","","----"]
[null,359,null,null,null,null,null,null,null,null,null,null,null,null,null,null,null,null,null,null,null,null,null,null,null,null,null,null,null,null,null,null,0,0,0,0,0,0,0,0,0,0,0,0,0,null,null,null,null,null,null,null,null,null,null,null,0,0,"E",null,null,null,null,null,null,null,null,null,null,0,0,"E",null,null,null,null,null,null,null,null,null,0,0,"E",null,null,null,null,null,null,null,null,null,null,null,0,0,"E",null,null,null,null,null,null,null,null,null,null,null,0,0,"E",null,null,null,null,null,null,null,null,null,null,0,0,"E",null,null,null,null,null,null,null,null,0,null,0,"E",null,null,null,null,null,null,null,null,null,0,null,0,"E",null,null,null,null,null,null,null,null,null,0,null,0,"E","---","ERR","","----"]
[null,360,null,null,null,null,null,null,null,null,null,null,null,null,null,null,null,null,null,null,null,null,null,null,null,null,null,null,null,null,null,null,0,0,0,0,0,0,0,0,0,0,0,0,0,null,null,null,null,null,null,null,null,null,null,null,0,0,"E",null,null,null,null,null,null,null,null,null,null,0,0,"E",null,null,null,null,null,null,null,null,null,0,0,"E",null,null,null,null,null,null,null,null,null,null,null,0,0,"E",null,null,null,null,null,null,null,null,null,null,null,0,0,"E",null,null,null,null,null,null,null,null,null,null,0,0,"E",null,null,null,null,null,null,null,null,0,null,0,"E",null,null,null,null,null,null,null,null,null,0,null,0,"E",null,null,null,null,null,null,null,null,null,0,null,0,"E","---","ERR","","----"]
[null,361,null,null,null,null,null,null,null,null,null,null,null,null,null,null,null,null,null,null,null,null,null,null,null,null,null,null,null,null,null,null,0,0,0,0,0,0,0,0,0,0,0,0,0,null,null,null,null,null,null,null,null,null,null,null,0,0,"E",null,null,null,null,null,null,null,null,null,null,0,0,"E",null,null,null,null,null,null,null,null,null,0,0,"E",null,null,null,null,null,null,null,null,null,null,null,0,0,"E",null,null,null,null,null,null,null,null,null,null,null,0,0,"E",null,null,null,null,null,null,null,null,null,null,0,0,"E",null,null,null,null,null,null,null,null,0,null,0,"E",null,null,null,null,null,null,null,null,null,0,null,0,"E",null,null,null,null,null,null,null,null,null,0,null,0,"E","---","ERR","","----"]
[null,362,null,null,null,null,null,null,null,null,null,null,null,null,null,null,null,null,null,null,null,null,null,null,null,null,null,null,null,null,null,null,0,0,0,0,0,0,0,0,0,0,0,0,0,null,null,null,null,null,null,null,null,null,null,null,0,0,"E",null,null,null,null,null,null,null,null,null,null,0,0,"E",null,null,null,null,null,null,null,null,null,0,0,"E",null,null,null,null,null,null,null,null,null,null,null,0,0,"E",null,null,null,null,null,null,null,null,null,null,null,0,0,"E",null,null,null,null,null,null,null,null,null,null,0,0,"E",null,null,null,null,null,null,null,null,0,null,0,"E",null,null,null,null,null,null,null,null,null,0,null,0,"E",null,null,null,null,null,null,null,null,null,0,null,0,"E","---","ERR","","----"]
[null,363,null,null,null,null,null,null,null,null,null,null,null,null,null,null,null,null,null,null,null,null,null,null,null,null,null,null,null,null,null,null,0,0,0,0,0,0,0,0,0,0,0,0,0,null,null,null,null,null,null,null,null,null,null,null,0,0,"E",null,null,null,null,null,null,null,null,null,null,0,0,"E",null,null,null,null,null,null,null,null,null,0,0,"E",null,null,null,null,null,null,null,null,null,null,null,0,0,"E",null,null,null,null,null,null,null,null,null,null,null,0,0,"E",null,null,null,null,null,null,null,null,null,null,0,0,"E",null,null,null,null,null,null,null,null,0,null,0,"E",null,null,null,null,null,null,null,null,null,0,null,0,"E",null,null,null,null,null,null,null,null,null,0,null,0,"E","---","ERR","","----"]
[null,364,null,null,null,null,null,null,null,null,null,null,null,null,null,null,null,null,null,null,null,null,null,null,null,null,null,null,null,null,null,null,0,0,0,0,0,0,0,0,0,0,0,0,0,null,null,null,null,null,null,null,null,null,null,null,0,0,"E",null,null,null,null,null,null,null,null,null,null,0,0,"E",null,null,null,null,null,null,null,null,null,0,0,"E",null,null,null,null,null,null,null,null,null,null,null,0,0,"E",null,null,null,null,null,null,null,null,null,null,null,0,0,"E",null,null,null,null,null,null,null,null,null,null,0,0,"E",null,null,null,null,null,null,null,null,0,null,0,"E",null,null,null,null,null,null,null,null,null,0,null,0,"E",null,null,null,null,null,null,null,null,null,0,null,0,"E","---","ERR","","----"]
[null,365,null,null,null,null,null,null,null,null,null,null,null,null,null,null,null,null,null,null,null,null,null,null,null,null,null,null,null,null,null,null,0,0,0,0,0,0,0,0,0,0,0,0,0,null,null,null,null,null,null,null,null,null,null,null,0,0,"E",null,null,null,null,null,null,null,null,null,null,0,0,"E",null,null,null,null,null,null,null,null,null,0,0,"E",null,null,null,null,null,null,null,null,null,null,null,0,0,"E",null,null,null,null,null,null,null,null,null,null,null,0,0,"E",null,null,null,null,null,null,null,null,null,null,0,0,"E",null,null,null,null,null,null,null,null,0,null,0,"E",null,null,null,null,null,null,null,null,null,0,null,0,"E",null,null,null,null,null,null,null,null,null,0,null,0,"E","---","ERR","","----"]
[null,366,null,null,null,null,null,null,null,null,null,null,null,null,null,null,null,null,null,null,null,null,null,null,null,null,null,null,null,null,null,null,0,0,0,0,0,0,0,0,0,0,0,0,0,null,null,null,null,null,null,null,null,null,null,null,0,0,"E",null,null,null,null,null,null,null,null,null,null,0,0,"E",null,null,null,null,null,null,null,null,null,0,0,"E",null,null,null,null,null,null,null,null,null,null,null,0,0,"E",null,null,null,null,null,null,null,null,null,null,null,0,0,"E",null,null,null,null,null,null,null,null,null,null,0,0,"E",null,null,null,null,null,null,null,null,0,null,0,"E",null,null,null,null,null,null,null,null,null,0,null,0,"E",null,null,null,null,null,null,null,null,null,0,null,0,"E","---","ERR","","----"]
[null,367,null,null,null,null,null,null,null,null,null,null,null,null,null,null,null,null,null,null,null,null,null,null,null,null,null,null,null,null,null,null,0,0,0,0,0,0,0,0,0,0,0,0,0,null,null,null,null,null,null,null,null,null,null,null,0,0,"E",null,null,null,null,null,null,null,null,null,null,0,0,"E",null,null,null,null,null,null,null,null,null,0,0,"E",null,null,null,null,null,null,null,null,null,null,null,0,0,"E",null,null,null,null,null,null,null,null,null,null,null,0,0,"E",null,null,null,null,null,null,null,null,null,null,0,0,"E",null,null,null,null,null,null,null,null,0,null,0,"E",null,null,null,null,null,null,null,null,null,0,null,0,"E",null,null,null,null,null,null,null,null,null,0,null,0,"E","---","ERR","","----"]
[null,368,null,null,null,null,null,null,null,null,null,null,null,null,null,null,null,null,null,null,null,null,null,null,null,null,null,null,null,null,null,null,0,0,0,0,0,0,0,0,0,0,0,0,0,null,null,null,null,null,null,null,null,null,null,null,0,0,"E",null,null,null,null,null,null,null,null,null,null,0,0,"E",null,null,null,null,null,null,null,null,null,0,0,"E",null,null,null,null,null,null,null,null,null,null,null,0,0,"E",null,null,null,null,null,null,null,null,null,null,null,0,0,"E",null,null,null,null,null,null,null,null,null,null,0,0,"E",null,null,null,null,null,null,null,null,0,null,0,"E",null,null,null,null,null,null,null,null,null,0,null,0,"E",null,null,null,null,null,null,null,null,null,0,null,0,"E","---","ERR","","----"]
[null,369,null,null,null,null,null,null,null,null,null,null,null,null,null,null,null,null,null,null,null,null,null,null,null,null,null,null,null,null,null,null,0,0,0,0,0,0,0,0,0,0,0,0,0,null,null,null,null,null,null,null,null,null,null,null,0,0,"E",null,null,null,null,null,null,null,null,null,null,0,0,"E",null,null,null,null,null,null,null,null,null,0,0,"E",null,null,null,null,null,null,null,null,null,null,null,0,0,"E",null,null,null,null,null,null,null,null,null,null,null,0,0,"E",null,null,null,null,null,null,null,null,null,null,0,0,"E",null,null,null,null,null,null,null,null,0,null,0,"E",null,null,null,null,null,null,null,null,null,0,null,0,"E",null,null,null,null,null,null,null,null,null,0,null,0,"E","---","ERR","","----"]
[null,370,null,null,null,null,null,null,null,null,null,null,null,null,null,null,null,null,null,null,null,null,null,null,null,null,null,null,null,null,null,null,0,0,0,0,0,0,0,0,0,0,0,0,0,null,null,null,null,null,null,null,null,null,null,null,0,0,"E",null,null,null,null,null,null,null,null,null,null,0,0,"E",null,null,null,null,null,null,null,null,null,0,0,"E",null,null,null,null,null,null,null,null,null,null,null,0,0,"E",null,null,null,null,null,null,null,null,null,null,null,0,0,"E",null,null,null,null,null,null,null,null,null,null,0,0,"E",null,null,null,null,null,null,null,null,0,null,0,"E",null,null,null,null,null,null,null,null,null,0,null,0,"E",null,null,null,null,null,null,null,null,null,0,null,0,"E","---","ERR","","----"]
[null,371,null,null,null,null,null,null,null,null,null,null,null,null,null,null,null,null,null,null,null,null,null,null,null,null,null,null,null,null,null,null,0,0,0,0,0,0,0,0,0,0,0,0,0,null,null,null,null,null,null,null,null,null,null,null,0,0,"E",null,null,null,null,null,null,null,null,null,null,0,0,"E",null,null,null,null,null,null,null,null,null,0,0,"E",null,null,null,null,null,null,null,null,null,null,null,0,0,"E",null,null,null,null,null,null,null,null,null,null,null,0,0,"E",null,null,null,null,null,null,null,null,null,null,0,0,"E",null,null,null,null,null,null,null,null,0,null,0,"E",null,null,null,null,null,null,null,null,null,0,null,0,"E",null,null,null,null,null,null,null,null,null,0,null,0,"E","---","ERR","","----"]
[null,372,null,null,null,null,null,null,null,null,null,null,null,null,null,null,null,null,null,null,null,null,null,null,null,null,null,null,null,null,null,null,0,0,0,0,0,0,0,0,0,0,0,0,0,null,null,null,null,null,null,null,null,null,null,null,0,0,"E",null,null,null,null,null,null,null,null,null,null,0,0,"E",null,null,null,null,null,null,null,null,null,0,0,"E",null,null,null,null,null,null,null,null,null,null,null,0,0,"E",null,null,null,null,null,null,null,null,null,null,null,0,0,"E",null,null,null,null,null,null,null,null,null,null,0,0,"E",null,null,null,null,null,null,null,null,0,null,0,"E",null,null,null,null,null,null,null,null,null,0,null,0,"E",null,null,null,null,null,null,null,null,null,0,null,0,"E","---","ERR","","----"]
[null,373,null,null,null,null,null,null,null,null,null,null,null,null,null,null,null,null,null,null,null,null,null,null,null,null,null,null,null,null,null,null,0,0,0,0,0,0,0,0,0,0,0,0,0,null,null,null,null,null,null,null,null,null,null,null,0,0,"E",null,null,null,null,null,null,null,null,null,null,0,0,"E",null,null,null,null,null,null,null,null,null,0,0,"E",null,null,null,null,null,null,null,null,null,null,null,0,0,"E",null,null,null,null,null,null,null,null,null,null,null,0,0,"E",null,null,null,null,null,null,null,null,null,null,0,0,"E",null,null,null,null,null,null,null,null,0,null,0,"E",null,null,null,null,null,null,null,null,null,0,null,0,"E",null,null,null,null,null,null,null,null,null,0,null,0,"E","---","ERR","","----"]
[null,374,null,null,null,null,null,null,null,null,null,null,null,null,null,null,null,null,null,null,null,null,null,null,null,null,null,null,null,null,null,null,0,0,0,0,0,0,0,0,0,0,0,0,0,null,null,null,null,null,null,null,null,null,null,null,0,0,"E",null,null,null,null,null,null,null,null,null,null,0,0,"E",null,null,null,null,null,null,null,null,null,0,0,"E",null,null,null,null,null,null,null,null,null,null,null,0,0,"E",null,null,null,null,null,null,null,null,null,null,null,0,0,"E",null,null,null,null,null,null,null,null,null,null,0,0,"E",null,null,null,null,null,null,null,null,0,null,0,"E",null,null,null,null,null,null,null,null,null,0,null,0,"E",null,null,null,null,null,null,null,null,null,0,null,0,"E","---","ERR","","----"]
[null,375,null,null,null,null,null,null,null,null,null,null,null,null,null,null,null,null,null,null,null,null,null,null,null,null,null,null,null,null,null,null,0,0,0,0,0,0,0,0,0,0,0,0,0,null,null,null,null,null,null,null,null,null,null,null,0,0,"E",null,null,null,null,null,null,null,null,null,null,0,0,"E",null,null,null,null,null,null,null,null,null,0,0,"E",null,null,null,null,null,null,null,null,null,null,null,0,0,"E",null,null,null,null,null,null,null,null,null,null,null,0,0,"E",null,null,null,null,null,null,null,null,null,null,0,0,"E",null,null,null,null,null,null,null,null,0,null,0,"E",null,null,null,null,null,null,null,null,null,0,null,0,"E",null,null,null,null,null,null,null,null,null,0,null,0,"E","---","ERR","","----"]
[null,376,null,null,null,null,null,null,null,null,null,null,null,null,null,null,null,null,null,null,null,null,null,null,null,null,null,null,null,null,null,null,0,0,0,0,0,0,0,0,0,0,0,0,0,null,null,null,null,null,null,null,null,null,null,null,0,0,"E",null,null,null,null,null,null,null,null,null,null,0,0,"E",null,null,null,null,null,null,null,null,null,0,0,"E",null,null,null,null,null,null,null,null,null,null,null,0,0,"E",null,null,null,null,null,null,null,null,null,null,null,0,0,"E",null,null,null,null,null,null,null,null,null,null,0,0,"E",null,null,null,null,null,null,null,null,0,null,0,"E",null,null,null,null,null,null,null,null,null,0,null,0,"E",null,null,null,null,null,null,null,null,null,0,null,0,"E","---","ERR","","----"]
[null,377,null,null,null,null,null,null,null,null,null,null,null,null,null,null,null,null,null,null,null,null,null,null,null,null,null,null,null,null,null,null,0,0,0,0,0,0,0,0,0,0,0,0,0,null,null,null,null,null,null,null,null,null,null,null,0,0,"E",null,null,null,null,null,null,null,null,null,null,0,0,"E",null,null,null,null,null,null,null,null,null,0,0,"E",null,null,null,null,null,null,null,null,null,null,null,0,0,"E",null,null,null,null,null,null,null,null,null,null,null,0,0,"E",null,null,null,null,null,null,null,null,null,null,0,0,"E",null,null,null,null,null,null,null,null,0,null,0,"E",null,null,null,null,null,null,null,null,null,0,null,0,"E",null,null,null,null,null,null,null,null,null,0,null,0,"E","---","ERR","","----"]
[null,378,null,null,null,null,null,null,null,null,null,null,null,null,null,null,null,null,null,null,null,null,null,null,null,null,null,null,null,null,null,null,0,0,0,0,0,0,0,0,0,0,0,0,0,null,null,null,null,null,null,null,null,null,null,null,0,0,"E",null,null,null,null,null,null,null,null,null,null,0,0,"E",null,null,null,null,null,null,null,null,null,0,0,"E",null,null,null,null,null,null,null,null,null,null,null,0,0,"E",null,null,null,null,null,null,null,null,null,null,null,0,0,"E",null,null,null,null,null,null,null,null,null,null,0,0,"E",null,null,null,null,null,null,null,null,0,null,0,"E",null,null,null,null,null,null,null,null,null,0,null,0,"E",null,null,null,null,null,null,null,null,null,0,null,0,"E","---","ERR","","----"]
[null,379,null,null,null,null,null,null,null,null,null,null,null,null,null,null,null,null,null,null,null,null,null,null,null,null,null,null,null,null,null,null,0,0,0,0,0,0,0,0,0,0,0,0,0,null,null,null,null,null,null,null,null,null,null,null,0,0,"E",null,null,null,null,null,null,null,null,null,null,0,0,"E",null,null,null,null,null,null,null,null,null,0,0,"E",null,null,null,null,null,null,null,null,null,null,null,0,0,"E",null,null,null,null,null,null,null,null,null,null,null,0,0,"E",null,null,null,null,null,null,null,null,null,null,0,0,"E",null,null,null,null,null,null,null,null,0,null,0,"E",null,null,null,null,null,null,null,null,null,0,null,0,"E",null,null,null,null,null,null,null,null,null,0,null,0,"E","---","ERR","","----"]
[null,380,null,null,null,null,null,null,null,null,null,null,null,null,null,null,null,null,null,null,null,null,null,null,null,null,null,null,null,null,null,null,0,0,0,0,0,0,0,0,0,0,0,0,0,null,null,null,null,null,null,null,null,null,null,null,0,0,"E",null,null,null,null,null,null,null,null,null,null,0,0,"E",null,null,null,null,null,null,null,null,null,0,0,"E",null,null,null,null,null,null,null,null,null,null,null,0,0,"E",null,null,null,null,null,null,null,null,null,null,null,0,0,"E",null,null,null,null,null,null,null,null,null,null,0,0,"E",null,null,null,null,null,null,null,null,0,null,0,"E",null,null,null,null,null,null,null,null,null,0,null,0,"E",null,null,null,null,null,null,null,null,null,0,null,0,"E","---","ERR","","----"]
[null,381,null,null,null,null,null,null,null,null,null,null,null,null,null,null,null,null,null,null,null,null,null,null,null,null,null,null,null,null,null,null,0,0,0,0,0,0,0,0,0,0,0,0,0,null,null,null,null,null,null,null,null,null,null,null,0,0,"E",null,null,null,null,null,null,null,null,null,null,0,0,"E",null,null,null,null,null,null,null,null,null,0,0,"E",null,null,null,null,null,null,null,null,null,null,null,0,0,"E",null,null,null,null,null,null,null,null,null,null,null,0,0,"E",null,null,null,null,null,null,null,null,null,null,0,0,"E",null,null,null,null,null,null,null,null,0,null,0,"E",null,null,null,null,null,null,null,null,null,0,null,0,"E",null,null,null,null,null,null,null,null,null,0,null,0,"E","---","ERR","","----"]
[null,382,null,null,null,null,null,null,null,null,null,null,null,null,null,null,null,null,null,null,null,null,null,null,null,null,null,null,null,null,null,null,0,0,0,0,0,0,0,0,0,0,0,0,0,null,null,null,null,null,null,null,null,null,null,null,0,0,"E",null,null,null,null,null,null,null,null,null,null,0,0,"E",null,null,null,null,null,null,null,null,null,0,0,"E",null,null,null,null,null,null,null,null,null,null,null,0,0,"E",null,null,null,null,null,null,null,null,null,null,null,0,0,"E",null,null,null,null,null,null,null,null,null,null,0,0,"E",null,null,null,null,null,null,null,null,0,null,0,"E",null,null,null,null,null,null,null,null,null,0,null,0,"E",null,null,null,null,null,null,null,null,null,0,null,0,"E","---","ERR","","----"]
[null,383,null,null,null,null,null,null,null,null,null,null,null,null,null,null,null,null,null,null,null,null,null,null,null,null,null,null,null,null,null,null,0,0,0,0,0,0,0,0,0,0,0,0,0,null,null,null,null,null,null,null,null,null,null,null,0,0,"E",null,null,null,null,null,null,null,null,null,null,0,0,"E",null,null,null,null,null,null,null,null,null,0,0,"E",null,null,null,null,null,null,null,null,null,null,null,0,0,"E",null,null,null,null,null,null,null,null,null,null,null,0,0,"E",null,null,null,null,null,null,null,null,null,null,0,0,"E",null,null,null,null,null,null,null,null,0,null,0,"E",null,null,null,null,null,null,null,null,null,0,null,0,"E",null,null,null,null,null,null,null,null,null,0,null,0,"E","---","ERR","","----"]
[null,384,null,null,null,null,null,null,null,null,null,null,null,null,null,null,null,null,null,null,null,null,null,null,null,null,null,null,null,null,null,null,0,0,0,0,0,0,0,0,0,0,0,0,0,null,null,null,null,null,null,null,null,null,null,null,0,0,"E",null,null,null,null,null,null,null,null,null,null,0,0,"E",null,null,null,null,null,null,null,null,null,0,0,"E",null,null,null,null,null,null,null,null,null,null,null,0,0,"E",null,null,null,null,null,null,null,null,null,null,null,0,0,"E",null,null,null,null,null,null,null,null,null,null,0,0,"E",null,null,null,null,null,null,null,null,0,null,0,"E",null,null,null,null,null,null,null,null,null,0,null,0,"E",null,null,null,null,null,null,null,null,null,0,null,0,"E","---","ERR","","----"]
[null,385,null,null,null,null,null,null,null,null,null,null,null,null,null,null,null,null,null,null,null,null,null,null,null,null,null,null,null,null,null,null,0,0,0,0,0,0,0,0,0,0,0,0,0,null,null,null,null,null,null,null,null,null,null,null,0,0,"E",null,null,null,null,null,null,null,null,null,null,0,0,"E",null,null,null,null,null,null,null,null,null,0,0,"E",null,null,null,null,null,null,null,null,null,null,null,0,0,"E",null,null,null,null,null,null,null,null,null,null,null,0,0,"E",null,null,null,null,null,null,null,null,null,null,0,0,"E",null,null,null,null,null,null,null,null,0,null,0,"E",null,null,null,null,null,null,null,null,null,0,null,0,"E",null,null,null,null,null,null,null,null,null,0,null,0,"E","---","ERR","","----"]
[null,386,null,null,null,null,null,null,null,null,null,null,null,null,null,null,null,null,null,null,null,null,null,null,null,null,null,null,null,null,null,null,{"$f":"SUM(V392:AF392)","v":0},{"$f":"V392/$V$4","v":0},{"$f":"W392/$W$4","v":0},{"$f":"X392/$X$4","v":0},{"$f":"Y392/$Y$4","v":0},{"$f":"Z392/$Z$4","v":0},{"$f":"AA392/$AA$4","v":0},{"$f":"AB392/$AB$4","v":0},{"$f":"AC392/$AC$4","v":0},{"$f":"AD392/$AD$4","v":0},{"$f":"AE392/$AE$4","v":0},{"$f":"AF392/$AF$4","v":0},{"$f":"AG392/$AG$4","v":0},null,null,null,null,null,null,null,null,null,null,null,{"$f":"SUM(AZ392:BD392)","v":0},{"$f":"BE392+AY392","v":0},{"$f":"IFERROR(IF(BF392>90,\"A+\",IF(BF392>80,\"A\",IF(BF392>70,\"B+\",IF(BF392>60,\"B\",IF(BF392>50,\"C+\",IF(BF392>40,\"C\",IF(BF392>=33,\"D\",\"E\"))))))),\"Abs\")","v":"E"},null,null,null,null,null,null,null,null,null,null,{"$f":"SUM(BM392:BQ392)","v":0},{"$f":"BR392+BL392","v":0},{"$f":"IFERROR(IF(BS392>90,\"A+\",IF(BS392>80,\"A\",IF(BS392>70,\"B+\",IF(BS392>60,\"B\",IF(BS392>50,\"C+\",IF(BS392>40,\"C\",IF(BS392>=33,\"D\",\"E\"))))))),\"Abs\")","v":"E"},null,null,null,null,null,null,null,null,null,{"$f":"SUM(BZ392:CC392)","v":0},{"$f":"CD392+BY392","v":0},{"$f":"IFERROR(IF(CE392>90,\"A+\",IF(CE392>80,\"A\",IF(CE392>70,\"B+\",IF(CE392>60,\"B\",IF(CE392>50,\"C+\",IF(CE392>40,\"C\",IF(CE392>=33,\"D\",\"E\"))))))),\"Abs\")","v":"E"},null,null,null,null,null,null,null,null,null,null,null,{"$f":"SUM(CL392:CQ392)","v":0},{"$f":"CR392+CK392","v":0},{"$f":"IFERROR(IF(CS392>90,\"A+\",IF(CS392>80,\"A\",IF(CS392>70,\"B+\",IF(CS392>60,\"B\",IF(CS392>50,\"C+\",IF(CS392>40,\"C\",IF(CS392>=33,\"D\",\"E\"))))))),\"Abs\")","v":"E"},null,null,null,null,null,null,null,null,null,null,null,{"$f":"SUM(CZ392:DE392)","v":0},{"$f":"DF392+CY392","v":0},{"$f":"IFERROR(IF(DG392>90,\"A+\",IF(DG392>80,\"A\",IF(DG392>70,\"B+\",IF(DG392>60,\"B\",IF(DG392>50,\"C+\",IF(DG392>40,\"C\",IF(DG392>=33,\"D\",\"E\"))))))),\"Abs\")","v":"E"},null,null,null,null,null,null,null,null,null,null,{"$f":"SUM(DN392:DR392)","v":0},{"$f":"DS392+DM392","v":0},{"$f":"IFERROR(IF(DT392>90,\"A+\",IF(DT392>80,\"A\",IF(DT392>70,\"B+\",IF(DT392>60,\"B\",IF(DT392>50,\"C+\",IF(DT392>40,\"C\",IF(DT392>=33,\"D\",\"E\"))))))),\"Abs\")","v":"E"},null,null,null,null,null,null,null,null,{"$f":"SUM(EA392:EC392)","v":0},null,{"$f":"EE392+ED392+DZ392","v":0},{"$f":"IFERROR(IF(EF392>90,\"A+\",IF(EF392>80,\"A\",IF(EF392>70,\"B+\",IF(EF392>60,\"B\",IF(EF392>50,\"C+\",IF(EF392>40,\"C\",IF(EF392>=33,\"D\",\"E\"))))))),\"Abs\")","v":"E"},null,null,null,null,null,null,null,null,null,{"$f":"SUM(EM392:EP392)","v":0},null,{"$f":"ER392+EQ392+EL392","v":0},{"$f":"IFERROR(IF(ES392>90,\"A+\",IF(ES392>80,\"A\",IF(ES392>70,\"B+\",IF(ES392>60,\"B\",IF(ES392>50,\"C+\",IF(ES392>40,\"C\",IF(ES392>=33,\"D\",\"E\"))))))),\"Abs\")","v":"E"},null,null,null,null,null,null,null,null,null,{"$f":"SUM(EZ392:FC392)","v":0},null,{"$f":"FE392+FD392+EY392","v":0},{"$f":"IFERROR(IF(FF392>90,\"A+\",IF(FF392>80,\"A\",IF(FF392>70,\"B+\",IF(FF392>60,\"B\",IF(FF392>50,\"C+\",IF(FF392>40,\"C\",IF(FF392>=33,\"D\",\"E\"))))))),\"Abs\")","v":"E"},{"$f":"IF(AND(MIN(AY392,BL392,BY392,CK392,CY392,DM392)>19,MIN(BF392,BS392,CE392,CS392,DG392,DT392)>32),SUM(BF392,BS392,CE392,CS392,DG392,DT392),\"---\")","v":"---"},{"$f":"IFERROR(FH392/600*100,\"ERR\")","v":"ERR"},{"$f":"IF(FI392=\"ERR\",\"\",(IF(FI392>90,\"A+\",IF(FI392>80,\"A\",IF(FI392>70,\"B+\",IF(FI392>60,\"B\",IF(FI392>50,\"C+\",IF(FI392>40,\"C\",IF(FI392>=33,\"D\",IF(FI392<33,\"E\",\"\"))))))))))","v":""},{"$f":"IF(FI392=\"ERR\",\"----\",IF(FI392>=33,\"ਪਾਸ\",\"--\"))","v":"----"}]
[null,387,null,null,null,null,null,null,null,null,null,null,null,null,null,null,null,null,null,null,null,null,null,null,null,null,null,null,null,null,null,null,0,0,0,0,0,0,0,0,0,0,0,0,0,null,null,null,null,null,null,null,null,null,null,null,0,0,"E",null,null,null,null,null,null,null,null,null,null,0,0,"E",null,null,null,null,null,null,null,null,null,0,0,"E",null,null,null,null,null,null,null,null,null,null,null,0,0,"E",null,null,null,null,null,null,null,null,null,null,null,0,0,"E",null,null,null,null,null,null,null,null,null,null,0,0,"E",null,null,null,null,null,null,null,null,0,null,0,"E",null,null,null,null,null,null,null,null,null,0,null,0,"E",null,null,null,null,null,null,null,null,null,0,null,0,"E","---","ERR","","----"]
[null,388,null,null,null,null,null,null,null,null,null,null,null,null,null,null,null,null,null,null,null,null,null,null,null,null,null,null,null,null,null,null,0,0,0,0,0,0,0,0,0,0,0,0,0,null,null,null,null,null,null,null,null,null,null,null,0,0,"E",null,null,null,null,null,null,null,null,null,null,0,0,"E",null,null,null,null,null,null,null,null,null,0,0,"E",null,null,null,null,null,null,null,null,null,null,null,0,0,"E",null,null,null,null,null,null,null,null,null,null,null,0,0,"E",null,null,null,null,null,null,null,null,null,null,0,0,"E",null,null,null,null,null,null,null,null,0,null,0,"E",null,null,null,null,null,null,null,null,null,0,null,0,"E",null,null,null,null,null,null,null,null,null,0,null,0,"E","---","ERR","","----"]
[null,389,null,null,null,null,null,null,null,null,null,null,null,null,null,null,null,null,null,null,null,null,null,null,null,null,null,null,null,null,null,null,0,0,0,0,0,0,0,0,0,0,0,0,0,null,null,null,null,null,null,null,null,null,null,null,0,0,"E",null,null,null,null,null,null,null,null,null,null,0,0,"E",null,null,null,null,null,null,null,null,null,0,0,"E",null,null,null,null,null,null,null,null,null,null,null,0,0,"E",null,null,null,null,null,null,null,null,null,null,null,0,0,"E",null,null,null,null,null,null,null,null,null,null,0,0,"E",null,null,null,null,null,null,null,null,0,null,0,"E",null,null,null,null,null,null,null,null,null,0,null,0,"E",null,null,null,null,null,null,null,null,null,0,null,0,"E","---","ERR","","----"]
[null,390,null,null,null,null,null,null,null,null,null,null,null,null,null,null,null,null,null,null,null,null,null,null,null,null,null,null,null,null,null,null,0,0,0,0,0,0,0,0,0,0,0,0,0,null,null,null,null,null,null,null,null,null,null,null,0,0,"E",null,null,null,null,null,null,null,null,null,null,0,0,"E",null,null,null,null,null,null,null,null,null,0,0,"E",null,null,null,null,null,null,null,null,null,null,null,0,0,"E",null,null,null,null,null,null,null,null,null,null,null,0,0,"E",null,null,null,null,null,null,null,null,null,null,0,0,"E",null,null,null,null,null,null,null,null,0,null,0,"E",null,null,null,null,null,null,null,null,null,0,null,0,"E",null,null,null,null,null,null,null,null,null,0,null,0,"E","---","ERR","","----"]
[null,391,null,null,null,null,null,null,null,null,null,null,null,null,null,null,null,null,null,null,null,null,null,null,null,null,null,null,null,null,null,null,0,0,0,0,0,0,0,0,0,0,0,0,0,null,null,null,null,null,null,null,null,null,null,null,0,0,"E",null,null,null,null,null,null,null,null,null,null,0,0,"E",null,null,null,null,null,null,null,null,null,0,0,"E",null,null,null,null,null,null,null,null,null,null,null,0,0,"E",null,null,null,null,null,null,null,null,null,null,null,0,0,"E",null,null,null,null,null,null,null,null,null,null,0,0,"E",null,null,null,null,null,null,null,null,0,null,0,"E",null,null,null,null,null,null,null,null,null,0,null,0,"E",null,null,null,null,null,null,null,null,null,0,null,0,"E","---","ERR","","----"]
[null,392,null,null,null,null,null,null,null,null,null,null,null,null,null,null,null,null,null,null,null,null,null,null,null,null,null,null,null,null,null,null,0,0,0,0,0,0,0,0,0,0,0,0,0,null,null,null,null,null,null,null,null,null,null,null,0,0,"E",null,null,null,null,null,null,null,null,null,null,0,0,"E",null,null,null,null,null,null,null,null,null,0,0,"E",null,null,null,null,null,null,null,null,null,null,null,0,0,"E",null,null,null,null,null,null,null,null,null,null,null,0,0,"E",null,null,null,null,null,null,null,null,null,null,0,0,"E",null,null,null,null,null,null,null,null,0,null,0,"E",null,null,null,null,null,null,null,null,null,0,null,0,"E",null,null,null,null,null,null,null,null,null,0,null,0,"E","---","ERR","","----"]
[null,393,null,null,null,null,null,null,null,null,null,null,null,null,null,null,null,null,null,null,null,null,null,null,null,null,null,null,null,null,null,null,0,0,0,0,0,0,0,0,0,0,0,0,0,null,null,null,null,null,null,null,null,null,null,null,0,0,"E",null,null,null,null,null,null,null,null,null,null,0,0,"E",null,null,null,null,null,null,null,null,null,0,0,"E",null,null,null,null,null,null,null,null,null,null,null,0,0,"E",null,null,null,null,null,null,null,null,null,null,null,0,0,"E",null,null,null,null,null,null,null,null,null,null,0,0,"E",null,null,null,null,null,null,null,null,0,null,0,"E",null,null,null,null,null,null,null,null,null,0,null,0,"E",null,null,null,null,null,null,null,null,null,0,null,0,"E","---","ERR","","----"]
[null,394,null,null,null,null,null,null,null,null,null,null,null,null,null,null,null,null,null,null,null,null,null,null,null,null,null,null,null,null,null,null,0,0,0,0,0,0,0,0,0,0,0,0,0,null,null,null,null,null,null,null,null,null,null,null,0,0,"E",null,null,null,null,null,null,null,null,null,null,0,0,"E",null,null,null,null,null,null,null,null,null,0,0,"E",null,null,null,null,null,null,null,null,null,null,null,0,0,"E",null,null,null,null,null,null,null,null,null,null,null,0,0,"E",null,null,null,null,null,null,null,null,null,null,0,0,"E",null,null,null,null,null,null,null,null,0,null,0,"E",null,null,null,null,null,null,null,null,null,0,null,0,"E",null,null,null,null,null,null,null,null,null,0,null,0,"E","---","ERR","","----"]
[null,395,null,null,null,null,null,null,null,null,null,null,null,null,null,null,null,null,null,null,null,null,null,null,null,null,null,null,null,null,null,null,0,0,0,0,0,0,0,0,0,0,0,0,0,null,null,null,null,null,null,null,null,null,null,null,0,0,"E",null,null,null,null,null,null,null,null,null,null,0,0,"E",null,null,null,null,null,null,null,null,null,0,0,"E",null,null,null,null,null,null,null,null,null,null,null,0,0,"E",null,null,null,null,null,null,null,null,null,null,null,0,0,"E",null,null,null,null,null,null,null,null,null,null,0,0,"E",null,null,null,null,null,null,null,null,0,null,0,"E",null,null,null,null,null,null,null,null,null,0,null,0,"E",null,null,null,null,null,null,null,null,null,0,null,0,"E","---","ERR","","----"]
[null,396,null,null,null,null,null,null,null,null,null,null,null,null,null,null,null,null,null,null,null,null,null,null,null,null,null,null,null,null,null,null,0,0,0,0,0,0,0,0,0,0,0,0,0,null,null,null,null,null,null,null,null,null,null,null,0,0,"E",null,null,null,null,null,null,null,null,null,null,0,0,"E",null,null,null,null,null,null,null,null,null,0,0,"E",null,null,null,null,null,null,null,null,null,null,null,0,0,"E",null,null,null,null,null,null,null,null,null,null,null,0,0,"E",null,null,null,null,null,null,null,null,null,null,0,0,"E",null,null,null,null,null,null,null,null,0,null,0,"E",null,null,null,null,null,null,null,null,null,0,null,0,"E",null,null,null,null,null,null,null,null,null,0,null,0,"E","---","ERR","","----"]
[null,397,null,null,null,null,null,null,null,null,null,null,null,null,null,null,null,null,null,null,null,null,null,null,null,null,null,null,null,null,null,null,0,0,0,0,0,0,0,0,0,0,0,0,0,null,null,null,null,null,null,null,null,null,null,null,0,0,"E",null,null,null,null,null,null,null,null,null,null,0,0,"E",null,null,null,null,null,null,null,null,null,0,0,"E",null,null,null,null,null,null,null,null,null,null,null,0,0,"E",null,null,null,null,null,null,null,null,null,null,null,0,0,"E",null,null,null,null,null,null,null,null,null,null,0,0,"E",null,null,null,null,null,null,null,null,0,null,0,"E",null,null,null,null,null,null,null,null,null,0,null,0,"E",null,null,null,null,null,null,null,null,null,0,null,0,"E","---","ERR","","----"]
[null,398,null,null,null,null,null,null,null,null,null,null,null,null,null,null,null,null,null,null,null,null,null,null,null,null,null,null,null,null,null,null,0,0,0,0,0,0,0,0,0,0,0,0,0,null,null,null,null,null,null,null,null,null,null,null,0,0,"E",null,null,null,null,null,null,null,null,null,null,0,0,"E",null,null,null,null,null,null,null,null,null,0,0,"E",null,null,null,null,null,null,null,null,null,null,null,0,0,"E",null,null,null,null,null,null,null,null,null,null,null,0,0,"E",null,null,null,null,null,null,null,null,null,null,0,0,"E",null,null,null,null,null,null,null,null,0,null,0,"E",null,null,null,null,null,null,null,null,null,0,null,0,"E",null,null,null,null,null,null,null,null,null,0,null,0,"E","---","ERR","","----"]
[null,399,null,null,null,null,null,null,null,null,null,null,null,null,null,null,null,null,null,null,null,null,null,null,null,null,null,null,null,null,null,null,0,0,0,0,0,0,0,0,0,0,0,0,0,null,null,null,null,null,null,null,null,null,null,null,0,0,"E",null,null,null,null,null,null,null,null,null,null,0,0,"E",null,null,null,null,null,null,null,null,null,0,0,"E",null,null,null,null,null,null,null,null,null,null,null,0,0,"E",null,null,null,null,null,null,null,null,null,null,null,0,0,"E",null,null,null,null,null,null,null,null,null,null,0,0,"E",null,null,null,null,null,null,null,null,0,null,0,"E",null,null,null,null,null,null,null,null,null,0,null,0,"E",null,null,null,null,null,null,null,null,null,0,null,0,"E","---","ERR","","----"]
[null,400,null,null,null,null,null,null,null,null,null,null,null,null,null,null,null,null,null,null,null,null,null,null,null,null,null,null,null,null,null,null,0,0,0,0,0,0,0,0,0,0,0,0,0,null,null,null,null,null,null,null,null,null,null,null,0,0,"E",null,null,null,null,null,null,null,null,null,null,0,0,"E",null,null,null,null,null,null,null,null,null,0,0,"E",null,null,null,null,null,null,null,null,null,null,null,0,0,"E",null,null,null,null,null,null,null,null,null,null,null,0,0,"E",null,null,null,null,null,null,null,null,null,null,0,0,"E",null,null,null,null,null,null,null,null,0,null,0,"E",null,null,null,null,null,null,null,null,null,0,null,0,"E",null,null,null,null,null,null,null,null,null,0,null,0,"E","---","ERR","","----"]
[null,401,null,null,null,null,null,null,null,null,null,null,null,null,null,null,null,null,null,null,null,null,null,null,null,null,null,null,null,null,null,null,0,0,0,0,0,0,0,0,0,0,0,0,0,null,null,null,null,null,null,null,null,null,null,null,0,0,"E",null,null,null,null,null,null,null,null,null,null,0,0,"E",null,null,null,null,null,null,null,null,null,0,0,"E",null,null,null,null,null,null,null,null,null,null,null,0,0,"E",null,null,null,null,null,null,null,null,null,null,null,0,0,"E",null,null,null,null,null,null,null,null,null,null,0,0,"E",null,null,null,null,null,null,null,null,0,null,0,"E",null,null,null,null,null,null,null,null,null,0,null,0,"E",null,null,null,null,null,null,null,null,null,0,null,0,"E","---","ERR","","----"]
[null,402,null,null,null,null,null,null,null,null,null,null,null,null,null,null,null,null,null,null,null,null,null,null,null,null,null,null,null,null,null,null,0,0,0,0,0,0,0,0,0,0,0,0,0,null,null,null,null,null,null,null,null,null,null,null,0,0,"E",null,null,null,null,null,null,null,null,null,null,0,0,"E",null,null,null,null,null,null,null,null,null,0,0,"E",null,null,null,null,null,null,null,null,null,null,null,0,0,"E",null,null,null,null,null,null,null,null,null,null,null,0,0,"E",null,null,null,null,null,null,null,null,null,null,0,0,"E",null,null,null,null,null,null,null,null,0,null,0,"E",null,null,null,null,null,null,null,null,null,0,null,0,"E",null,null,null,null,null,null,null,null,null,0,null,0,"E","---","ERR","","----"]
[null,403,null,null,null,null,null,null,null,null,null,null,null,null,null,null,null,null,null,null,null,null,null,null,null,null,null,null,null,null,null,null,0,0,0,0,0,0,0,0,0,0,0,0,0,null,null,null,null,null,null,null,null,null,null,null,0,0,"E",null,null,null,null,null,null,null,null,null,null,0,0,"E",null,null,null,null,null,null,null,null,null,0,0,"E",null,null,null,null,null,null,null,null,null,null,null,0,0,"E",null,null,null,null,null,null,null,null,null,null,null,0,0,"E",null,null,null,null,null,null,null,null,null,null,0,0,"E",null,null,null,null,null,null,null,null,0,null,0,"E",null,null,null,null,null,null,null,null,null,0,null,0,"E",null,null,null,null,null,null,null,null,null,0,null,0,"E","---","ERR","","----"]
[null,404,null,null,null,null,null,null,null,null,null,null,null,null,null,null,null,null,null,null,null,null,null,null,null,null,null,null,null,null,null,null,0,0,0,0,0,0,0,0,0,0,0,0,0,null,null,null,null,null,null,null,null,null,null,null,0,0,"E",null,null,null,null,null,null,null,null,null,null,0,0,"E",null,null,null,null,null,null,null,null,null,0,0,"E",null,null,null,null,null,null,null,null,null,null,null,0,0,"E",null,null,null,null,null,null,null,null,null,null,null,0,0,"E",null,null,null,null,null,null,null,null,null,null,0,0,"E",null,null,null,null,null,null,null,null,0,null,0,"E",null,null,null,null,null,null,null,null,null,0,null,0,"E",null,null,null,null,null,null,null,null,null,0,null,0,"E","---","ERR","","----"]
[null,405,null,null,null,null,null,null,null,null,null,null,null,null,null,null,null,null,null,null,null,null,null,null,null,null,null,null,null,null,null,null,0,0,0,0,0,0,0,0,0,0,0,0,0,null,null,null,null,null,null,null,null,null,null,null,0,0,"E",null,null,null,null,null,null,null,null,null,null,0,0,"E",null,null,null,null,null,null,null,null,null,0,0,"E",null,null,null,null,null,null,null,null,null,null,null,0,0,"E",null,null,null,null,null,null,null,null,null,null,null,0,0,"E",null,null,null,null,null,null,null,null,null,null,0,0,"E",null,null,null,null,null,null,null,null,0,null,0,"E",null,null,null,null,null,null,null,null,null,0,null,0,"E",null,null,null,null,null,null,null,null,null,0,null,0,"E","---","ERR","","----"]
[null,406,null,null,null,null,null,null,null,null,null,null,null,null,null,null,null,null,null,null,null,null,null,null,null,null,null,null,null,null,null,null,0,0,0,0,0,0,0,0,0,0,0,0,0,null,null,null,null,null,null,null,null,null,null,null,0,0,"E",null,null,null,null,null,null,null,null,null,null,0,0,"E",null,null,null,null,null,null,null,null,null,0,0,"E",null,null,null,null,null,null,null,null,null,null,null,0,0,"E",null,null,null,null,null,null,null,null,null,null,null,0,0,"E",null,null,null,null,null,null,null,null,null,null,0,0,"E",null,null,null,null,null,null,null,null,0,null,0,"E",null,null,null,null,null,null,null,null,null,0,null,0,"E",null,null,null,null,null,null,null,null,null,0,null,0,"E","---","ERR","","----"]
[null,407,null,null,null,null,null,null,null,null,null,null,null,null,null,null,null,null,null,null,null,null,null,null,null,null,null,null,null,null,null,null,0,0,0,0,0,0,0,0,0,0,0,0,0,null,null,null,null,null,null,null,null,null,null,null,0,0,"E",null,null,null,null,null,null,null,null,null,null,0,0,"E",null,null,null,null,null,null,null,null,null,0,0,"E",null,null,null,null,null,null,null,null,null,null,null,0,0,"E",null,null,null,null,null,null,null,null,null,null,null,0,0,"E",null,null,null,null,null,null,null,null,null,null,0,0,"E",null,null,null,null,null,null,null,null,0,null,0,"E",null,null,null,null,null,null,null,null,null,0,null,0,"E",null,null,null,null,null,null,null,null,null,0,null,0,"E","---","ERR","","----"]
[null,408,null,null,null,null,null,null,null,null,null,null,null,null,null,null,null,null,null,null,null,null,null,null,null,null,null,null,null,null,null,null,0,0,0,0,0,0,0,0,0,0,0,0,0,null,null,null,null,null,null,null,null,null,null,null,0,0,"E",null,null,null,null,null,null,null,null,null,null,0,0,"E",null,null,null,null,null,null,null,null,null,0,0,"E",null,null,null,null,null,null,null,null,null,null,null,0,0,"E",null,null,null,null,null,null,null,null,null,null,null,0,0,"E",null,null,null,null,null,null,null,null,null,null,0,0,"E",null,null,null,null,null,null,null,null,0,null,0,"E",null,null,null,null,null,null,null,null,null,0,null,0,"E",null,null,null,null,null,null,null,null,null,0,null,0,"E","---","ERR","","----"]
[null,409,null,null,null,null,null,null,null,null,null,null,null,null,null,null,null,null,null,null,null,null,null,null,null,null,null,null,null,null,null,null,0,0,0,0,0,0,0,0,0,0,0,0,0,null,null,null,null,null,null,null,null,null,null,null,0,0,"E",null,null,null,null,null,null,null,null,null,null,0,0,"E",null,null,null,null,null,null,null,null,null,0,0,"E",null,null,null,null,null,null,null,null,null,null,null,0,0,"E",null,null,null,null,null,null,null,null,null,null,null,0,0,"E",null,null,null,null,null,null,null,null,null,null,0,0,"E",null,null,null,null,null,null,null,null,0,null,0,"E",null,null,null,null,null,null,null,null,null,0,null,0,"E",null,null,null,null,null,null,null,null,null,0,null,0,"E","---","ERR","","----"]
[null,410,null,null,null,null,null,null,null,null,null,null,null,null,null,null,null,null,null,null,null,null,null,null,null,null,null,null,null,null,null,null,0,0,0,0,0,0,0,0,0,0,0,0,0,null,null,null,null,null,null,null,null,null,null,null,0,0,"E",null,null,null,null,null,null,null,null,null,null,0,0,"E",null,null,null,null,null,null,null,null,null,0,0,"E",null,null,null,null,null,null,null,null,null,null,null,0,0,"E",null,null,null,null,null,null,null,null,null,null,null,0,0,"E",null,null,null,null,null,null,null,null,null,null,0,0,"E",null,null,null,null,null,null,null,null,0,null,0,"E",null,null,null,null,null,null,null,null,null,0,null,0,"E",null,null,null,null,null,null,null,null,null,0,null,0,"E","---","ERR","","----"]
[null,411,null,null,null,null,null,null,null,null,null,null,null,null,null,null,null,null,null,null,null,null,null,null,null,null,null,null,null,null,null,null,0,0,0,0,0,0,0,0,0,0,0,0,0,null,null,null,null,null,null,null,null,null,null,null,0,0,"E",null,null,null,null,null,null,null,null,null,null,0,0,"E",null,null,null,null,null,null,null,null,null,0,0,"E",null,null,null,null,null,null,null,null,null,null,null,0,0,"E",null,null,null,null,null,null,null,null,null,null,null,0,0,"E",null,null,null,null,null,null,null,null,null,null,0,0,"E",null,null,null,null,null,null,null,null,0,null,0,"E",null,null,null,null,null,null,null,null,null,0,null,0,"E",null,null,null,null,null,null,null,null,null,0,null,0,"E","---","ERR","","----"]
[null,412,null,null,null,null,null,null,null,null,null,null,null,null,null,null,null,null,null,null,null,null,null,null,null,null,null,null,null,null,null,null,0,0,0,0,0,0,0,0,0,0,0,0,0,null,null,null,null,null,null,null,null,null,null,null,0,0,"E",null,null,null,null,null,null,null,null,null,null,0,0,"E",null,null,null,null,null,null,null,null,null,0,0,"E",null,null,null,null,null,null,null,null,null,null,null,0,0,"E",null,null,null,null,null,null,null,null,null,null,null,0,0,"E",null,null,null,null,null,null,null,null,null,null,0,0,"E",null,null,null,null,null,null,null,null,0,null,0,"E",null,null,null,null,null,null,null,null,null,0,null,0,"E",null,null,null,null,null,null,null,null,null,0,null,0,"E","---","ERR","","----"]
[null,413,null,null,null,null,null,null,null,null,null,null,null,null,null,null,null,null,null,null,null,null,null,null,null,null,null,null,null,null,null,null,0,0,0,0,0,0,0,0,0,0,0,0,0,null,null,null,null,null,null,null,null,null,null,null,0,0,"E",null,null,null,null,null,null,null,null,null,null,0,0,"E",null,null,null,null,null,null,null,null,null,0,0,"E",null,null,null,null,null,null,null,null,null,null,null,0,0,"E",null,null,null,null,null,null,null,null,null,null,null,0,0,"E",null,null,null,null,null,null,null,null,null,null,0,0,"E",null,null,null,null,null,null,null,null,0,null,0,"E",null,null,null,null,null,null,null,null,null,0,null,0,"E",null,null,null,null,null,null,null,null,null,0,null,0,"E","---","ERR","","----"]
[null,414,null,null,null,null,null,null,null,null,null,null,null,null,null,null,null,null,null,null,null,null,null,null,null,null,null,null,null,null,null,null,0,0,0,0,0,0,0,0,0,0,0,0,0,null,null,null,null,null,null,null,null,null,null,null,0,0,"E",null,null,null,null,null,null,null,null,null,null,0,0,"E",null,null,null,null,null,null,null,null,null,0,0,"E",null,null,null,null,null,null,null,null,null,null,null,0,0,"E",null,null,null,null,null,null,null,null,null,null,null,0,0,"E",null,null,null,null,null,null,null,null,null,null,0,0,"E",null,null,null,null,null,null,null,null,0,null,0,"E",null,null,null,null,null,null,null,null,null,0,null,0,"E",null,null,null,null,null,null,null,null,null,0,null,0,"E","---","ERR","","----"]
[null,415,null,null,null,null,null,null,null,null,null,null,null,null,null,null,null,null,null,null,null,null,null,null,null,null,null,null,null,null,null,null,0,0,0,0,0,0,0,0,0,0,0,0,0,null,null,null,null,null,null,null,null,null,null,null,0,0,"E",null,null,null,null,null,null,null,null,null,null,0,0,"E",null,null,null,null,null,null,null,null,null,0,0,"E",null,null,null,null,null,null,null,null,null,null,null,0,0,"E",null,null,null,null,null,null,null,null,null,null,null,0,0,"E",null,null,null,null,null,null,null,null,null,null,0,0,"E",null,null,null,null,null,null,null,null,0,null,0,"E",null,null,null,null,null,null,null,null,null,0,null,0,"E",null,null,null,null,null,null,null,null,null,0,null,0,"E","---","ERR","","----"]
[null,416,null,null,null,null,null,null,null,null,null,null,null,null,null,null,null,null,null,null,null,null,null,null,null,null,null,null,null,null,null,null,0,0,0,0,0,0,0,0,0,0,0,0,0,null,null,null,null,null,null,null,null,null,null,null,0,0,"E",null,null,null,null,null,null,null,null,null,null,0,0,"E",null,null,null,null,null,null,null,null,null,0,0,"E",null,null,null,null,null,null,null,null,null,null,null,0,0,"E",null,null,null,null,null,null,null,null,null,null,null,0,0,"E",null,null,null,null,null,null,null,null,null,null,0,0,"E",null,null,null,null,null,null,null,null,0,null,0,"E",null,null,null,null,null,null,null,null,null,0,null,0,"E",null,null,null,null,null,null,null,null,null,0,null,0,"E","---","ERR","","----"]
[null,417,null,null,null,null,null,null,null,null,null,null,null,null,null,null,null,null,null,null,null,null,null,null,null,null,null,null,null,null,null,null,0,0,0,0,0,0,0,0,0,0,0,0,0,null,null,null,null,null,null,null,null,null,null,null,0,0,"E",null,null,null,null,null,null,null,null,null,null,0,0,"E",null,null,null,null,null,null,null,null,null,0,0,"E",null,null,null,null,null,null,null,null,null,null,null,0,0,"E",null,null,null,null,null,null,null,null,null,null,null,0,0,"E",null,null,null,null,null,null,null,null,null,null,0,0,"E",null,null,null,null,null,null,null,null,0,null,0,"E",null,null,null,null,null,null,null,null,null,0,null,0,"E",null,null,null,null,null,null,null,null,null,0,null,0,"E","---","ERR","","----"]
[null,418,null,null,null,null,null,null,null,null,null,null,null,null,null,null,null,null,null,null,null,null,null,null,null,null,null,null,null,null,null,null,0,0,0,0,0,0,0,0,0,0,0,0,0,null,null,null,null,null,null,null,null,null,null,null,0,0,"E",null,null,null,null,null,null,null,null,null,null,0,0,"E",null,null,null,null,null,null,null,null,null,0,0,"E",null,null,null,null,null,null,null,null,null,null,null,0,0,"E",null,null,null,null,null,null,null,null,null,null,null,0,0,"E",null,null,null,null,null,null,null,null,null,null,0,0,"E",null,null,null,null,null,null,null,null,0,null,0,"E",null,null,null,null,null,null,null,null,null,0,null,0,"E",null,null,null,null,null,null,null,null,null,0,null,0,"E","---","ERR","","----"]
[null,419,null,null,null,null,null,null,null,null,null,null,null,null,null,null,null,null,null,null,null,null,null,null,null,null,null,null,null,null,null,null,0,0,0,0,0,0,0,0,0,0,0,0,0,null,null,null,null,null,null,null,null,null,null,null,0,0,"E",null,null,null,null,null,null,null,null,null,null,0,0,"E",null,null,null,null,null,null,null,null,null,0,0,"E",null,null,null,null,null,null,null,null,null,null,null,0,0,"E",null,null,null,null,null,null,null,null,null,null,null,0,0,"E",null,null,null,null,null,null,null,null,null,null,0,0,"E",null,null,null,null,null,null,null,null,0,null,0,"E",null,null,null,null,null,null,null,null,null,0,null,0,"E",null,null,null,null,null,null,null,null,null,0,null,0,"E","---","ERR","","----"]
[null,420,null,null,null,null,null,null,null,null,null,null,null,null,null,null,null,null,null,null,null,null,null,null,null,null,null,null,null,null,null,null,0,0,0,0,0,0,0,0,0,0,0,0,0,null,null,null,null,null,null,null,null,null,null,null,0,0,"E",null,null,null,null,null,null,null,null,null,null,0,0,"E",null,null,null,null,null,null,null,null,null,0,0,"E",null,null,null,null,null,null,null,null,null,null,null,0,0,"E",null,null,null,null,null,null,null,null,null,null,null,0,0,"E",null,null,null,null,null,null,null,null,null,null,0,0,"E",null,null,null,null,null,null,null,null,0,null,0,"E",null,null,null,null,null,null,null,null,null,0,null,0,"E",null,null,null,null,null,null,null,null,null,0,null,0,"E","---","ERR","","----"]
[null,421,null,null,null,null,null,null,null,null,null,null,null,null,null,null,null,null,null,null,null,null,null,null,null,null,null,null,null,null,null,null,0,0,0,0,0,0,0,0,0,0,0,0,0,null,null,null,null,null,null,null,null,null,null,null,0,0,"E",null,null,null,null,null,null,null,null,null,null,0,0,"E",null,null,null,null,null,null,null,null,null,0,0,"E",null,null,null,null,null,null,null,null,null,null,null,0,0,"E",null,null,null,null,null,null,null,null,null,null,null,0,0,"E",null,null,null,null,null,null,null,null,null,null,0,0,"E",null,null,null,null,null,null,null,null,0,null,0,"E",null,null,null,null,null,null,null,null,null,0,null,0,"E",null,null,null,null,null,null,null,null,null,0,null,0,"E","---","ERR","","----"]
[null,422,null,null,null,null,null,null,null,null,null,null,null,null,null,null,null,null,null,null,null,null,null,null,null,null,null,null,null,null,null,null,0,0,0,0,0,0,0,0,0,0,0,0,0,null,null,null,null,null,null,null,null,null,null,null,0,0,"E",null,null,null,null,null,null,null,null,null,null,0,0,"E",null,null,null,null,null,null,null,null,null,0,0,"E",null,null,null,null,null,null,null,null,null,null,null,0,0,"E",null,null,null,null,null,null,null,null,null,null,null,0,0,"E",null,null,null,null,null,null,null,null,null,null,0,0,"E",null,null,null,null,null,null,null,null,0,null,0,"E",null,null,null,null,null,null,null,null,null,0,null,0,"E",null,null,null,null,null,null,null,null,null,0,null,0,"E","---","ERR","","----"]
[null,423,null,null,null,null,null,null,null,null,null,null,null,null,null,null,null,null,null,null,null,null,null,null,null,null,null,null,null,null,null,null,0,0,0,0,0,0,0,0,0,0,0,0,0,null,null,null,null,null,null,null,null,null,null,null,0,0,"E",null,null,null,null,null,null,null,null,null,null,0,0,"E",null,null,null,null,null,null,null,null,null,0,0,"E",null,null,null,null,null,null,null,null,null,null,null,0,0,"E",null,null,null,null,null,null,null,null,null,null,null,0,0,"E",null,null,null,null,null,null,null,null,null,null,0,0,"E",null,null,null,null,null,null,null,null,0,null,0,"E",null,null,null,null,null,null,null,null,null,0,null,0,"E",null,null,null,null,null,null,null,null,null,0,null,0,"E","---","ERR","","----"]
[null,424,null,null,null,null,null,null,null,null,null,null,null,null,null,null,null,null,null,null,null,null,null,null,null,null,null,null,null,null,null,null,0,0,0,0,0,0,0,0,0,0,0,0,0,null,null,null,null,null,null,null,null,null,null,null,0,0,"E",null,null,null,null,null,null,null,null,null,null,0,0,"E",null,null,null,null,null,null,null,null,null,0,0,"E",null,null,null,null,null,null,null,null,null,null,null,0,0,"E",null,null,null,null,null,null,null,null,null,null,null,0,0,"E",null,null,null,null,null,null,null,null,null,null,0,0,"E",null,null,null,null,null,null,null,null,0,null,0,"E",null,null,null,null,null,null,null,null,null,0,null,0,"E",null,null,null,null,null,null,null,null,null,0,null,0,"E","---","ERR","","----"]
[null,425,null,null,null,null,null,null,null,null,null,null,null,null,null,null,null,null,null,null,null,null,null,null,null,null,null,null,null,null,null,null,0,0,0,0,0,0,0,0,0,0,0,0,0,null,null,null,null,null,null,null,null,null,null,null,0,0,"E",null,null,null,null,null,null,null,null,null,null,0,0,"E",null,null,null,null,null,null,null,null,null,0,0,"E",null,null,null,null,null,null,null,null,null,null,null,0,0,"E",null,null,null,null,null,null,null,null,null,null,null,0,0,"E",null,null,null,null,null,null,null,null,null,null,0,0,"E",null,null,null,null,null,null,null,null,0,null,0,"E",null,null,null,null,null,null,null,null,null,0,null,0,"E",null,null,null,null,null,null,null,null,null,0,null,0,"E","---","ERR","","----"]
[null,426,null,null,null,null,null,null,null,null,null,null,null,null,null,null,null,null,null,null,null,null,null,null,null,null,null,null,null,null,null,null,0,0,0,0,0,0,0,0,0,0,0,0,0,null,null,null,null,null,null,null,null,null,null,null,0,0,"E",null,null,null,null,null,null,null,null,null,null,0,0,"E",null,null,null,null,null,null,null,null,null,0,0,"E",null,null,null,null,null,null,null,null,null,null,null,0,0,"E",null,null,null,null,null,null,null,null,null,null,null,0,0,"E",null,null,null,null,null,null,null,null,null,null,0,0,"E",null,null,null,null,null,null,null,null,0,null,0,"E",null,null,null,null,null,null,null,null,null,0,null,0,"E",null,null,null,null,null,null,null,null,null,0,null,0,"E","---","ERR","","----"]
[null,427,null,null,null,null,null,null,null,null,null,null,null,null,null,null,null,null,null,null,null,null,null,null,null,null,null,null,null,null,null,null,0,0,0,0,0,0,0,0,0,0,0,0,0,null,null,null,null,null,null,null,null,null,null,null,0,0,"E",null,null,null,null,null,null,null,null,null,null,0,0,"E",null,null,null,null,null,null,null,null,null,0,0,"E",null,null,null,null,null,null,null,null,null,null,null,0,0,"E",null,null,null,null,null,null,null,null,null,null,null,0,0,"E",null,null,null,null,null,null,null,null,null,null,0,0,"E",null,null,null,null,null,null,null,null,0,null,0,"E",null,null,null,null,null,null,null,null,null,0,null,0,"E",null,null,null,null,null,null,null,null,null,0,null,0,"E","---","ERR","","----"]
[null,428,null,null,null,null,null,null,null,null,null,null,null,null,null,null,null,null,null,null,null,null,null,null,null,null,null,null,null,null,null,null,0,0,0,0,0,0,0,0,0,0,0,0,0,null,null,null,null,null,null,null,null,null,null,null,0,0,"E",null,null,null,null,null,null,null,null,null,null,0,0,"E",null,null,null,null,null,null,null,null,null,0,0,"E",null,null,null,null,null,null,null,null,null,null,null,0,0,"E",null,null,null,null,null,null,null,null,null,null,null,0,0,"E",null,null,null,null,null,null,null,null,null,null,0,0,"E",null,null,null,null,null,null,null,null,0,null,0,"E",null,null,null,null,null,null,null,null,null,0,null,0,"E",null,null,null,null,null,null,null,null,null,0,null,0,"E","---","ERR","","----"]
[null,429,null,null,null,null,null,null,null,null,null,null,null,null,null,null,null,null,null,null,null,null,null,null,null,null,null,null,null,null,null,null,0,0,0,0,0,0,0,0,0,0,0,0,0,null,null,null,null,null,null,null,null,null,null,null,0,0,"E",null,null,null,null,null,null,null,null,null,null,0,0,"E",null,null,null,null,null,null,null,null,null,0,0,"E",null,null,null,null,null,null,null,null,null,null,null,0,0,"E",null,null,null,null,null,null,null,null,null,null,null,0,0,"E",null,null,null,null,null,null,null,null,null,null,0,0,"E",null,null,null,null,null,null,null,null,0,null,0,"E",null,null,null,null,null,null,null,null,null,0,null,0,"E",null,null,null,null,null,null,null,null,null,0,null,0,"E","---","ERR","","----"]
[null,430,null,null,null,null,null,null,null,null,null,null,null,null,null,null,null,null,null,null,null,null,null,null,null,null,null,null,null,null,null,null,0,0,0,0,0,0,0,0,0,0,0,0,0,null,null,null,null,null,null,null,null,null,null,null,0,0,"E",null,null,null,null,null,null,null,null,null,null,0,0,"E",null,null,null,null,null,null,null,null,null,0,0,"E",null,null,null,null,null,null,null,null,null,null,null,0,0,"E",null,null,null,null,null,null,null,null,null,null,null,0,0,"E",null,null,null,null,null,null,null,null,null,null,0,0,"E",null,null,null,null,null,null,null,null,0,null,0,"E",null,null,null,null,null,null,null,null,null,0,null,0,"E",null,null,null,null,null,null,null,null,null,0,null,0,"E","---","ERR","","----"]
[null,431,null,null,null,null,null,null,null,null,null,null,null,null,null,null,null,null,null,null,null,null,null,null,null,null,null,null,null,null,null,null,0,0,0,0,0,0,0,0,0,0,0,0,0,null,null,null,null,null,null,null,null,null,null,null,0,0,"E",null,null,null,null,null,null,null,null,null,null,0,0,"E",null,null,null,null,null,null,null,null,null,0,0,"E",null,null,null,null,null,null,null,null,null,null,null,0,0,"E",null,null,null,null,null,null,null,null,null,null,null,0,0,"E",null,null,null,null,null,null,null,null,null,null,0,0,"E",null,null,null,null,null,null,null,null,0,null,0,"E",null,null,null,null,null,null,null,null,null,0,null,0,"E",null,null,null,null,null,null,null,null,null,0,null,0,"E","---","ERR","","----"]
[null,432,null,null,null,null,null,null,null,null,null,null,null,null,null,null,null,null,null,null,null,null,null,null,null,null,null,null,null,null,null,null,0,0,0,0,0,0,0,0,0,0,0,0,0,null,null,null,null,null,null,null,null,null,null,null,0,0,"E",null,null,null,null,null,null,null,null,null,null,0,0,"E",null,null,null,null,null,null,null,null,null,0,0,"E",null,null,null,null,null,null,null,null,null,null,null,0,0,"E",null,null,null,null,null,null,null,null,null,null,null,0,0,"E",null,null,null,null,null,null,null,null,null,null,0,0,"E",null,null,null,null,null,null,null,null,0,null,0,"E",null,null,null,null,null,null,null,null,null,0,null,0,"E",null,null,null,null,null,null,null,null,null,0,null,0,"E","---","ERR","","----"]
[null,433,null,null,null,null,null,null,null,null,null,null,null,null,null,null,null,null,null,null,null,null,null,null,null,null,null,null,null,null,null,null,0,0,0,0,0,0,0,0,0,0,0,0,0,null,null,null,null,null,null,null,null,null,null,null,0,0,"E",null,null,null,null,null,null,null,null,null,null,0,0,"E",null,null,null,null,null,null,null,null,null,0,0,"E",null,null,null,null,null,null,null,null,null,null,null,0,0,"E",null,null,null,null,null,null,null,null,null,null,null,0,0,"E",null,null,null,null,null,null,null,null,null,null,0,0,"E",null,null,null,null,null,null,null,null,0,null,0,"E",null,null,null,null,null,null,null,null,null,0,null,0,"E",null,null,null,null,null,null,null,null,null,0,null,0,"E","---","ERR","","----"]
[null,434,null,null,null,null,null,null,null,null,null,null,null,null,null,null,null,null,null,null,null,null,null,null,null,null,null,null,null,null,null,null,0,0,0,0,0,0,0,0,0,0,0,0,0,null,null,null,null,null,null,null,null,null,null,null,0,0,"E",null,null,null,null,null,null,null,null,null,null,0,0,"E",null,null,null,null,null,null,null,null,null,0,0,"E",null,null,null,null,null,null,null,null,null,null,null,0,0,"E",null,null,null,null,null,null,null,null,null,null,null,0,0,"E",null,null,null,null,null,null,null,null,null,null,0,0,"E",null,null,null,null,null,null,null,null,0,null,0,"E",null,null,null,null,null,null,null,null,null,0,null,0,"E",null,null,null,null,null,null,null,null,null,0,null,0,"E","---","ERR","","----"]
[null,435,null,null,null,null,null,null,null,null,null,null,null,null,null,null,null,null,null,null,null,null,null,null,null,null,null,null,null,null,null,null,0,0,0,0,0,0,0,0,0,0,0,0,0,null,null,null,null,null,null,null,null,null,null,null,0,0,"E",null,null,null,null,null,null,null,null,null,null,0,0,"E",null,null,null,null,null,null,null,null,null,0,0,"E",null,null,null,null,null,null,null,null,null,null,null,0,0,"E",null,null,null,null,null,null,null,null,null,null,null,0,0,"E",null,null,null,null,null,null,null,null,null,null,0,0,"E",null,null,null,null,null,null,null,null,0,null,0,"E",null,null,null,null,null,null,null,null,null,0,null,0,"E",null,null,null,null,null,null,null,null,null,0,null,0,"E","---","ERR","","----"]
[null,436,null,null,null,null,null,null,null,null,null,null,null,null,null,null,null,null,null,null,null,null,null,null,null,null,null,null,null,null,null,null,0,0,0,0,0,0,0,0,0,0,0,0,0,null,null,null,null,null,null,null,null,null,null,null,0,0,"E",null,null,null,null,null,null,null,null,null,null,0,0,"E",null,null,null,null,null,null,null,null,null,0,0,"E",null,null,null,null,null,null,null,null,null,null,null,0,0,"E",null,null,null,null,null,null,null,null,null,null,null,0,0,"E",null,null,null,null,null,null,null,null,null,null,0,0,"E",null,null,null,null,null,null,null,null,0,null,0,"E",null,null,null,null,null,null,null,null,null,0,null,0,"E",null,null,null,null,null,null,null,null,null,0,null,0,"E","---","ERR","","----"]
[null,437,null,null,null,null,null,null,null,null,null,null,null,null,null,null,null,null,null,null,null,null,null,null,null,null,null,null,null,null,null,null,0,0,0,0,0,0,0,0,0,0,0,0,0,null,null,null,null,null,null,null,null,null,null,null,0,0,"E",null,null,null,null,null,null,null,null,null,null,0,0,"E",null,null,null,null,null,null,null,null,null,0,0,"E",null,null,null,null,null,null,null,null,null,null,null,0,0,"E",null,null,null,null,null,null,null,null,null,null,null,0,0,"E",null,null,null,null,null,null,null,null,null,null,0,0,"E",null,null,null,null,null,null,null,null,0,null,0,"E",null,null,null,null,null,null,null,null,null,0,null,0,"E",null,null,null,null,null,null,null,null,null,0,null,0,"E","---","ERR","","----"]
[null,438,null,null,null,null,null,null,null,null,null,null,null,null,null,null,null,null,null,null,null,null,null,null,null,null,null,null,null,null,null,null,0,0,0,0,0,0,0,0,0,0,0,0,0,null,null,null,null,null,null,null,null,null,null,null,0,0,"E",null,null,null,null,null,null,null,null,null,null,0,0,"E",null,null,null,null,null,null,null,null,null,0,0,"E",null,null,null,null,null,null,null,null,null,null,null,0,0,"E",null,null,null,null,null,null,null,null,null,null,null,0,0,"E",null,null,null,null,null,null,null,null,null,null,0,0,"E",null,null,null,null,null,null,null,null,0,null,0,"E",null,null,null,null,null,null,null,null,null,0,null,0,"E",null,null,null,null,null,null,null,null,null,0,null,0,"E","---","ERR","","----"]
[null,439,null,null,null,null,null,null,null,null,null,null,null,null,null,null,null,null,null,null,null,null,null,null,null,null,null,null,null,null,null,null,0,0,0,0,0,0,0,0,0,0,0,0,0,null,null,null,null,null,null,null,null,null,null,null,0,0,"E",null,null,null,null,null,null,null,null,null,null,0,0,"E",null,null,null,null,null,null,null,null,null,0,0,"E",null,null,null,null,null,null,null,null,null,null,null,0,0,"E",null,null,null,null,null,null,null,null,null,null,null,0,0,"E",null,null,null,null,null,null,null,null,null,null,0,0,"E",null,null,null,null,null,null,null,null,0,null,0,"E",null,null,null,null,null,null,null,null,null,0,null,0,"E",null,null,null,null,null,null,null,null,null,0,null,0,"E","---","ERR","","----"]
[null,440,null,null,null,null,null,null,null,null,null,null,null,null,null,null,null,null,null,null,null,null,null,null,null,null,null,null,null,null,null,null,0,0,0,0,0,0,0,0,0,0,0,0,0,null,null,null,null,null,null,null,null,null,null,null,0,0,"E",null,null,null,null,null,null,null,null,null,null,0,0,"E",null,null,null,null,null,null,null,null,null,0,0,"E",null,null,null,null,null,null,null,null,null,null,null,0,0,"E",null,null,null,null,null,null,null,null,null,null,null,0,0,"E",null,null,null,null,null,null,null,null,null,null,0,0,"E",null,null,null,null,null,null,null,null,0,null,0,"E",null,null,null,null,null,null,null,null,null,0,null,0,"E",null,null,null,null,null,null,null,null,null,0,null,0,"E","---","ERR","","----"]
[null,441,null,null,null,null,null,null,null,null,null,null,null,null,null,null,null,null,null,null,null,null,null,null,null,null,null,null,null,null,null,null,0,0,0,0,0,0,0,0,0,0,0,0,0,null,null,null,null,null,null,null,null,null,null,null,0,0,"E",null,null,null,null,null,null,null,null,null,null,0,0,"E",null,null,null,null,null,null,null,null,null,0,0,"E",null,null,null,null,null,null,null,null,null,null,null,0,0,"E",null,null,null,null,null,null,null,null,null,null,null,0,0,"E",null,null,null,null,null,null,null,null,null,null,0,0,"E",null,null,null,null,null,null,null,null,0,null,0,"E",null,null,null,null,null,null,null,null,null,0,null,0,"E",null,null,null,null,null,null,null,null,null,0,null,0,"E","---","ERR","","----"]
[null,442,null,null,null,null,null,null,null,null,null,null,null,null,null,null,null,null,null,null,null,null,null,null,null,null,null,null,null,null,null,null,0,0,0,0,0,0,0,0,0,0,0,0,0,null,null,null,null,null,null,null,null,null,null,null,0,0,"E",null,null,null,null,null,null,null,null,null,null,0,0,"E",null,null,null,null,null,null,null,null,null,0,0,"E",null,null,null,null,null,null,null,null,null,null,null,0,0,"E",null,null,null,null,null,null,null,null,null,null,null,0,0,"E",null,null,null,null,null,null,null,null,null,null,0,0,"E",null,null,null,null,null,null,null,null,0,null,0,"E",null,null,null,null,null,null,null,null,null,0,null,0,"E",null,null,null,null,null,null,null,null,null,0,null,0,"E","---","ERR","","----"]
[null,443,null,null,null,null,null,null,null,null,null,null,null,null,null,null,null,null,null,null,null,null,null,null,null,null,null,null,null,null,null,null,0,0,0,0,0,0,0,0,0,0,0,0,0,null,null,null,null,null,null,null,null,null,null,null,0,0,"E",null,null,null,null,null,null,null,null,null,null,0,0,"E",null,null,null,null,null,null,null,null,null,0,0,"E",null,null,null,null,null,null,null,null,null,null,null,0,0,"E",null,null,null,null,null,null,null,null,null,null,null,0,0,"E",null,null,null,null,null,null,null,null,null,null,0,0,"E",null,null,null,null,null,null,null,null,0,null,0,"E",null,null,null,null,null,null,null,null,null,0,null,0,"E",null,null,null,null,null,null,null,null,null,0,null,0,"E","---","ERR","","----"]
[null,444,null,null,null,null,null,null,null,null,null,null,null,null,null,null,null,null,null,null,null,null,null,null,null,null,null,null,null,null,null,null,0,0,0,0,0,0,0,0,0,0,0,0,0,null,null,null,null,null,null,null,null,null,null,null,0,0,"E",null,null,null,null,null,null,null,null,null,null,0,0,"E",null,null,null,null,null,null,null,null,null,0,0,"E",null,null,null,null,null,null,null,null,null,null,null,0,0,"E",null,null,null,null,null,null,null,null,null,null,null,0,0,"E",null,null,null,null,null,null,null,null,null,null,0,0,"E",null,null,null,null,null,null,null,null,0,null,0,"E",null,null,null,null,null,null,null,null,null,0,null,0,"E",null,null,null,null,null,null,null,null,null,0,null,0,"E","---","ERR","","----"]
[null,445,null,null,null,null,null,null,null,null,null,null,null,null,null,null,null,null,null,null,null,null,null,null,null,null,null,null,null,null,null,null,0,0,0,0,0,0,0,0,0,0,0,0,0,null,null,null,null,null,null,null,null,null,null,null,0,0,"E",null,null,null,null,null,null,null,null,null,null,0,0,"E",null,null,null,null,null,null,null,null,null,0,0,"E",null,null,null,null,null,null,null,null,null,null,null,0,0,"E",null,null,null,null,null,null,null,null,null,null,null,0,0,"E",null,null,null,null,null,null,null,null,null,null,0,0,"E",null,null,null,null,null,null,null,null,0,null,0,"E",null,null,null,null,null,null,null,null,null,0,null,0,"E",null,null,null,null,null,null,null,null,null,0,null,0,"E","---","ERR","","----"]
[null,446,null,null,null,null,null,null,null,null,null,null,null,null,null,null,null,null,null,null,null,null,null,null,null,null,null,null,null,null,null,null,0,0,0,0,0,0,0,0,0,0,0,0,0,null,null,null,null,null,null,null,null,null,null,null,0,0,"E",null,null,null,null,null,null,null,null,null,null,0,0,"E",null,null,null,null,null,null,null,null,null,0,0,"E",null,null,null,null,null,null,null,null,null,null,null,0,0,"E",null,null,null,null,null,null,null,null,null,null,null,0,0,"E",null,null,null,null,null,null,null,null,null,null,0,0,"E",null,null,null,null,null,null,null,null,0,null,0,"E",null,null,null,null,null,null,null,null,null,0,null,0,"E",null,null,null,null,null,null,null,null,null,0,null,0,"E","---","ERR","","----"]
[null,447,null,null,null,null,null,null,null,null,null,null,null,null,null,null,null,null,null,null,null,null,null,null,null,null,null,null,null,null,null,null,0,0,0,0,0,0,0,0,0,0,0,0,0,null,null,null,null,null,null,null,null,null,null,null,0,0,"E",null,null,null,null,null,null,null,null,null,null,0,0,"E",null,null,null,null,null,null,null,null,null,0,0,"E",null,null,null,null,null,null,null,null,null,null,null,0,0,"E",null,null,null,null,null,null,null,null,null,null,null,0,0,"E",null,null,null,null,null,null,null,null,null,null,0,0,"E",null,null,null,null,null,null,null,null,0,null,0,"E",null,null,null,null,null,null,null,null,null,0,null,0,"E",null,null,null,null,null,null,null,null,null,0,null,0,"E","---","ERR","","----"]
[null,448,null,null,null,null,null,null,null,null,null,null,null,null,null,null,null,null,null,null,null,null,null,null,null,null,null,null,null,null,null,null,0,0,0,0,0,0,0,0,0,0,0,0,0,null,null,null,null,null,null,null,null,null,null,null,0,0,"E",null,null,null,null,null,null,null,null,null,null,0,0,"E",null,null,null,null,null,null,null,null,null,0,0,"E",null,null,null,null,null,null,null,null,null,null,null,0,0,"E",null,null,null,null,null,null,null,null,null,null,null,0,0,"E",null,null,null,null,null,null,null,null,null,null,0,0,"E",null,null,null,null,null,null,null,null,0,null,0,"E",null,null,null,null,null,null,null,null,null,0,null,0,"E",null,null,null,null,null,null,null,null,null,0,null,0,"E","---","ERR","","----"]
[null,449,null,null,null,null,null,null,null,null,null,null,null,null,null,null,null,null,null,null,null,null,null,null,null,null,null,null,null,null,null,null,0,0,0,0,0,0,0,0,0,0,0,0,0,null,null,null,null,null,null,null,null,null,null,null,0,0,"E",null,null,null,null,null,null,null,null,null,null,0,0,"E",null,null,null,null,null,null,null,null,null,0,0,"E",null,null,null,null,null,null,null,null,null,null,null,0,0,"E",null,null,null,null,null,null,null,null,null,null,null,0,0,"E",null,null,null,null,null,null,null,null,null,null,0,0,"E",null,null,null,null,null,null,null,null,0,null,0,"E",null,null,null,null,null,null,null,null,null,0,null,0,"E",null,null,null,null,null,null,null,null,null,0,null,0,"E","---","ERR","","----"]
[null,450,null,null,null,null,null,null,null,null,null,null,null,null,null,null,null,null,null,null,null,null,null,null,null,null,null,null,null,null,null,null,{"$f":"SUM(V456:AF456)","v":0},{"$f":"V456/$V$4","v":0},{"$f":"W456/$W$4","v":0},{"$f":"X456/$X$4","v":0},{"$f":"Y456/$Y$4","v":0},{"$f":"Z456/$Z$4","v":0},{"$f":"AA456/$AA$4","v":0},{"$f":"AB456/$AB$4","v":0},{"$f":"AC456/$AC$4","v":0},{"$f":"AD456/$AD$4","v":0},{"$f":"AE456/$AE$4","v":0},{"$f":"AF456/$AF$4","v":0},{"$f":"AG456/$AG$4","v":0},null,null,null,null,null,null,null,null,null,null,null,{"$f":"SUM(AZ456:BD456)","v":0},{"$f":"BE456+AY456","v":0},{"$f":"IFERROR(IF(BF456>90,\"A+\",IF(BF456>80,\"A\",IF(BF456>70,\"B+\",IF(BF456>60,\"B\",IF(BF456>50,\"C+\",IF(BF456>40,\"C\",IF(BF456>=33,\"D\",\"E\"))))))),\"Abs\")","v":"E"},null,null,null,null,null,null,null,null,null,null,{"$f":"SUM(BM456:BQ456)","v":0},{"$f":"BR456+BL456","v":0},{"$f":"IFERROR(IF(BS456>90,\"A+\",IF(BS456>80,\"A\",IF(BS456>70,\"B+\",IF(BS456>60,\"B\",IF(BS456>50,\"C+\",IF(BS456>40,\"C\",IF(BS456>=33,\"D\",\"E\"))))))),\"Abs\")","v":"E"},null,null,null,null,null,null,null,null,null,{"$f":"SUM(BZ456:CC456)","v":0},{"$f":"CD456+BY456","v":0},{"$f":"IFERROR(IF(CE456>90,\"A+\",IF(CE456>80,\"A\",IF(CE456>70,\"B+\",IF(CE456>60,\"B\",IF(CE456>50,\"C+\",IF(CE456>40,\"C\",IF(CE456>=33,\"D\",\"E\"))))))),\"Abs\")","v":"E"},null,null,null,null,null,null,null,null,null,null,null,{"$f":"SUM(CL456:CQ456)","v":0},{"$f":"CR456+CK456","v":0},{"$f":"IFERROR(IF(CS456>90,\"A+\",IF(CS456>80,\"A\",IF(CS456>70,\"B+\",IF(CS456>60,\"B\",IF(CS456>50,\"C+\",IF(CS456>40,\"C\",IF(CS456>=33,\"D\",\"E\"))))))),\"Abs\")","v":"E"},null,null,null,null,null,null,null,null,null,null,null,{"$f":"SUM(CZ456:DE456)","v":0},{"$f":"DF456+CY456","v":0},{"$f":"IFERROR(IF(DG456>90,\"A+\",IF(DG456>80,\"A\",IF(DG456>70,\"B+\",IF(DG456>60,\"B\",IF(DG456>50,\"C+\",IF(DG456>40,\"C\",IF(DG456>=33,\"D\",\"E\"))))))),\"Abs\")","v":"E"},null,null,null,null,null,null,null,null,null,null,{"$f":"SUM(DN456:DR456)","v":0},{"$f":"DS456+DM456","v":0},{"$f":"IFERROR(IF(DT456>90,\"A+\",IF(DT456>80,\"A\",IF(DT456>70,\"B+\",IF(DT456>60,\"B\",IF(DT456>50,\"C+\",IF(DT456>40,\"C\",IF(DT456>=33,\"D\",\"E\"))))))),\"Abs\")","v":"E"},null,null,null,null,null,null,null,null,{"$f":"SUM(EA456:EC456)","v":0},null,{"$f":"EE456+ED456+DZ456","v":0},{"$f":"IFERROR(IF(EF456>90,\"A+\",IF(EF456>80,\"A\",IF(EF456>70,\"B+\",IF(EF456>60,\"B\",IF(EF456>50,\"C+\",IF(EF456>40,\"C\",IF(EF456>=33,\"D\",\"E\"))))))),\"Abs\")","v":"E"},null,null,null,null,null,null,null,null,null,{"$f":"SUM(EM456:EP456)","v":0},null,{"$f":"ER456+EQ456+EL456","v":0},{"$f":"IFERROR(IF(ES456>90,\"A+\",IF(ES456>80,\"A\",IF(ES456>70,\"B+\",IF(ES456>60,\"B\",IF(ES456>50,\"C+\",IF(ES456>40,\"C\",IF(ES456>=33,\"D\",\"E\"))))))),\"Abs\")","v":"E"},null,null,null,null,null,null,null,null,null,{"$f":"SUM(EZ456:FC456)","v":0},null,{"$f":"FE456+FD456+EY456","v":0},{"$f":"IFERROR(IF(FF456>90,\"A+\",IF(FF456>80,\"A\",IF(FF456>70,\"B+\",IF(FF456>60,\"B\",IF(FF456>50,\"C+\",IF(FF456>40,\"C\",IF(FF456>=33,\"D\",\"E\"))))))),\"Abs\")","v":"E"},{"$f":"IF(AND(MIN(AY456,BL456,BY456,CK456,CY456,DM456)>19,MIN(BF456,BS456,CE456,CS456,DG456,DT456)>32),SUM(BF456,BS456,CE456,CS456,DG456,DT456),\"---\")","v":"---"},{"$f":"IFERROR(FH456/600*100,\"ERR\")","v":"ERR"},{"$f":"IF(FI456=\"ERR\",\"\",(IF(FI456>90,\"A+\",IF(FI456>80,\"A\",IF(FI456>70,\"B+\",IF(FI456>60,\"B\",IF(FI456>50,\"C+\",IF(FI456>40,\"C\",IF(FI456>=33,\"D\",IF(FI456<33,\"E\",\"\"))))))))))","v":""},{"$f":"IF(FI456=\"ERR\",\"----\",IF(FI456>=33,\"ਪਾਸ\",\"--\"))","v":"----"}]
[null,451,null,null,null,null,null,null,null,null,null,null,null,null,null,null,null,null,null,null,null,null,null,null,null,null,null,null,null,null,null,null,0,0,0,0,0,0,0,0,0,0,0,0,0,null,null,null,null,null,null,null,null,null,null,null,0,0,"E",null,null,null,null,null,null,null,null,null,null,0,0,"E",null,null,null,null,null,null,null,null,null,0,0,"E",null,null,null,null,null,null,null,null,null,null,null,0,0,"E",null,null,null,null,null,null,null,null,null,null,null,0,0,"E",null,null,null,null,null,null,null,null,null,null,0,0,"E",null,null,null,null,null,null,null,null,0,null,0,"E",null,null,null,null,null,null,null,null,null,0,null,0,"E",null,null,null,null,null,null,null,null,null,0,null,0,"E","---","ERR","","----"]
[null,452,null,null,null,null,null,null,null,null,null,null,null,null,null,null,null,null,null,null,null,null,null,null,null,null,null,null,null,null,null,null,0,0,0,0,0,0,0,0,0,0,0,0,0,null,null,null,null,null,null,null,null,null,null,null,0,0,"E",null,null,null,null,null,null,null,null,null,null,0,0,"E",null,null,null,null,null,null,null,null,null,0,0,"E",null,null,null,null,null,null,null,null,null,null,null,0,0,"E",null,null,null,null,null,null,null,null,null,null,null,0,0,"E",null,null,null,null,null,null,null,null,null,null,0,0,"E",null,null,null,null,null,null,null,null,0,null,0,"E",null,null,null,null,null,null,null,null,null,0,null,0,"E",null,null,null,null,null,null,null,null,null,0,null,0,"E","---","ERR","","----"]
[null,453,null,null,null,null,null,null,null,null,null,null,null,null,null,null,null,null,null,null,null,null,null,null,null,null,null,null,null,null,null,null,0,0,0,0,0,0,0,0,0,0,0,0,0,null,null,null,null,null,null,null,null,null,null,null,0,0,"E",null,null,null,null,null,null,null,null,null,null,0,0,"E",null,null,null,null,null,null,null,null,null,0,0,"E",null,null,null,null,null,null,null,null,null,null,null,0,0,"E",null,null,null,null,null,null,null,null,null,null,null,0,0,"E",null,null,null,null,null,null,null,null,null,null,0,0,"E",null,null,null,null,null,null,null,null,0,null,0,"E",null,null,null,null,null,null,null,null,null,0,null,0,"E",null,null,null,null,null,null,null,null,null,0,null,0,"E","---","ERR","","----"]
[null,454,null,null,null,null,null,null,null,null,null,null,null,null,null,null,null,null,null,null,null,null,null,null,null,null,null,null,null,null,null,null,0,0,0,0,0,0,0,0,0,0,0,0,0,null,null,null,null,null,null,null,null,null,null,null,0,0,"E",null,null,null,null,null,null,null,null,null,null,0,0,"E",null,null,null,null,null,null,null,null,null,0,0,"E",null,null,null,null,null,null,null,null,null,null,null,0,0,"E",null,null,null,null,null,null,null,null,null,null,null,0,0,"E",null,null,null,null,null,null,null,null,null,null,0,0,"E",null,null,null,null,null,null,null,null,0,null,0,"E",null,null,null,null,null,null,null,null,null,0,null,0,"E",null,null,null,null,null,null,null,null,null,0,null,0,"E","---","ERR","","----"]
[null,455,null,null,null,null,null,null,null,null,null,null,null,null,null,null,null,null,null,null,null,null,null,null,null,null,null,null,null,null,null,null,0,0,0,0,0,0,0,0,0,0,0,0,0,null,null,null,null,null,null,null,null,null,null,null,0,0,"E",null,null,null,null,null,null,null,null,null,null,0,0,"E",null,null,null,null,null,null,null,null,null,0,0,"E",null,null,null,null,null,null,null,null,null,null,null,0,0,"E",null,null,null,null,null,null,null,null,null,null,null,0,0,"E",null,null,null,null,null,null,null,null,null,null,0,0,"E",null,null,null,null,null,null,null,null,0,null,0,"E",null,null,null,null,null,null,null,null,null,0,null,0,"E",null,null,null,null,null,null,null,null,null,0,null,0,"E","---","ERR","","----"]
[null,456,null,null,null,null,null,null,null,null,null,null,null,null,null,null,null,null,null,null,null,null,null,null,null,null,null,null,null,null,null,null,0,0,0,0,0,0,0,0,0,0,0,0,0,null,null,null,null,null,null,null,null,null,null,null,0,0,"E",null,null,null,null,null,null,null,null,null,null,0,0,"E",null,null,null,null,null,null,null,null,null,0,0,"E",null,null,null,null,null,null,null,null,null,null,null,0,0,"E",null,null,null,null,null,null,null,null,null,null,null,0,0,"E",null,null,null,null,null,null,null,null,null,null,0,0,"E",null,null,null,null,null,null,null,null,0,null,0,"E",null,null,null,null,null,null,null,null,null,0,null,0,"E",null,null,null,null,null,null,null,null,null,0,null,0,"E","---","ERR","","----"]
[null,457,null,null,null,null,null,null,null,null,null,null,null,null,null,null,null,null,null,null,null,null,null,null,null,null,null,null,null,null,null,null,0,0,0,0,0,0,0,0,0,0,0,0,0,null,null,null,null,null,null,null,null,null,null,null,0,0,"E",null,null,null,null,null,null,null,null,null,null,0,0,"E",null,null,null,null,null,null,null,null,null,0,0,"E",null,null,null,null,null,null,null,null,null,null,null,0,0,"E",null,null,null,null,null,null,null,null,null,null,null,0,0,"E",null,null,null,null,null,null,null,null,null,null,0,0,"E",null,null,null,null,null,null,null,null,0,null,0,"E",null,null,null,null,null,null,null,null,null,0,null,0,"E",null,null,null,null,null,null,null,null,null,0,null,0,"E","---","ERR","","----"]
[null,458,null,null,null,null,null,null,null,null,null,null,null,null,null,null,null,null,null,null,null,null,null,null,null,null,null,null,null,null,null,null,0,0,0,0,0,0,0,0,0,0,0,0,0,null,null,null,null,null,null,null,null,null,null,null,0,0,"E",null,null,null,null,null,null,null,null,null,null,0,0,"E",null,null,null,null,null,null,null,null,null,0,0,"E",null,null,null,null,null,null,null,null,null,null,null,0,0,"E",null,null,null,null,null,null,null,null,null,null,null,0,0,"E",null,null,null,null,null,null,null,null,null,null,0,0,"E",null,null,null,null,null,null,null,null,0,null,0,"E",null,null,null,null,null,null,null,null,null,0,null,0,"E",null,null,null,null,null,null,null,null,null,0,null,0,"E","---","ERR","","----"]
[null,459,null,null,null,null,null,null,null,null,null,null,null,null,null,null,null,null,null,null,null,null,null,null,null,null,null,null,null,null,null,null,0,0,0,0,0,0,0,0,0,0,0,0,0,null,null,null,null,null,null,null,null,null,null,null,0,0,"E",null,null,null,null,null,null,null,null,null,null,0,0,"E",null,null,null,null,null,null,null,null,null,0,0,"E",null,null,null,null,null,null,null,null,null,null,null,0,0,"E",null,null,null,null,null,null,null,null,null,null,null,0,0,"E",null,null,null,null,null,null,null,null,null,null,0,0,"E",null,null,null,null,null,null,null,null,0,null,0,"E",null,null,null,null,null,null,null,null,null,0,null,0,"E",null,null,null,null,null,null,null,null,null,0,null,0,"E","---","ERR","","----"]
[null,460,null,null,null,null,null,null,null,null,null,null,null,null,null,null,null,null,null,null,null,null,null,null,null,null,null,null,null,null,null,null,0,0,0,0,0,0,0,0,0,0,0,0,0,null,null,null,null,null,null,null,null,null,null,null,0,0,"E",null,null,null,null,null,null,null,null,null,null,0,0,"E",null,null,null,null,null,null,null,null,null,0,0,"E",null,null,null,null,null,null,null,null,null,null,null,0,0,"E",null,null,null,null,null,null,null,null,null,null,null,0,0,"E",null,null,null,null,null,null,null,null,null,null,0,0,"E",null,null,null,null,null,null,null,null,0,null,0,"E",null,null,null,null,null,null,null,null,null,0,null,0,"E",null,null,null,null,null,null,null,null,null,0,null,0,"E","---","ERR","","----"]
[null,461,null,null,null,null,null,null,null,null,null,null,null,null,null,null,null,null,null,null,null,null,null,null,null,null,null,null,null,null,null,null,0,0,0,0,0,0,0,0,0,0,0,0,0,null,null,null,null,null,null,null,null,null,null,null,0,0,"E",null,null,null,null,null,null,null,null,null,null,0,0,"E",null,null,null,null,null,null,null,null,null,0,0,"E",null,null,null,null,null,null,null,null,null,null,null,0,0,"E",null,null,null,null,null,null,null,null,null,null,null,0,0,"E",null,null,null,null,null,null,null,null,null,null,0,0,"E",null,null,null,null,null,null,null,null,0,null,0,"E",null,null,null,null,null,null,null,null,null,0,null,0,"E",null,null,null,null,null,null,null,null,null,0,null,0,"E","---","ERR","","----"]
[null,462,null,null,null,null,null,null,null,null,null,null,null,null,null,null,null,null,null,null,null,null,null,null,null,null,null,null,null,null,null,null,0,0,0,0,0,0,0,0,0,0,0,0,0,null,null,null,null,null,null,null,null,null,null,null,0,0,"E",null,null,null,null,null,null,null,null,null,null,0,0,"E",null,null,null,null,null,null,null,null,null,0,0,"E",null,null,null,null,null,null,null,null,null,null,null,0,0,"E",null,null,null,null,null,null,null,null,null,null,null,0,0,"E",null,null,null,null,null,null,null,null,null,null,0,0,"E",null,null,null,null,null,null,null,null,0,null,0,"E",null,null,null,null,null,null,null,null,null,0,null,0,"E",null,null,null,null,null,null,null,null,null,0,null,0,"E","---","ERR","","----"]
[null,463,null,null,null,null,null,null,null,null,null,null,null,null,null,null,null,null,null,null,null,null,null,null,null,null,null,null,null,null,null,null,0,0,0,0,0,0,0,0,0,0,0,0,0,null,null,null,null,null,null,null,null,null,null,null,0,0,"E",null,null,null,null,null,null,null,null,null,null,0,0,"E",null,null,null,null,null,null,null,null,null,0,0,"E",null,null,null,null,null,null,null,null,null,null,null,0,0,"E",null,null,null,null,null,null,null,null,null,null,null,0,0,"E",null,null,null,null,null,null,null,null,null,null,0,0,"E",null,null,null,null,null,null,null,null,0,null,0,"E",null,null,null,null,null,null,null,null,null,0,null,0,"E",null,null,null,null,null,null,null,null,null,0,null,0,"E","---","ERR","","----"]
[null,464,null,null,null,null,null,null,null,null,null,null,null,null,null,null,null,null,null,null,null,null,null,null,null,null,null,null,null,null,null,null,0,0,0,0,0,0,0,0,0,0,0,0,0,null,null,null,null,null,null,null,null,null,null,null,0,0,"E",null,null,null,null,null,null,null,null,null,null,0,0,"E",null,null,null,null,null,null,null,null,null,0,0,"E",null,null,null,null,null,null,null,null,null,null,null,0,0,"E",null,null,null,null,null,null,null,null,null,null,null,0,0,"E",null,null,null,null,null,null,null,null,null,null,0,0,"E",null,null,null,null,null,null,null,null,0,null,0,"E",null,null,null,null,null,null,null,null,null,0,null,0,"E",null,null,null,null,null,null,null,null,null,0,null,0,"E","---","ERR","","----"]
[null,465,null,null,null,null,null,null,null,null,null,null,null,null,null,null,null,null,null,null,null,null,null,null,null,null,null,null,null,null,null,null,0,0,0,0,0,0,0,0,0,0,0,0,0,null,null,null,null,null,null,null,null,null,null,null,0,0,"E",null,null,null,null,null,null,null,null,null,null,0,0,"E",null,null,null,null,null,null,null,null,null,0,0,"E",null,null,null,null,null,null,null,null,null,null,null,0,0,"E",null,null,null,null,null,null,null,null,null,null,null,0,0,"E",null,null,null,null,null,null,null,null,null,null,0,0,"E",null,null,null,null,null,null,null,null,0,null,0,"E",null,null,null,null,null,null,null,null,null,0,null,0,"E",null,null,null,null,null,null,null,null,null,0,null,0,"E","---","ERR","","----"]
[null,466,null,null,null,null,null,null,null,null,null,null,null,null,null,null,null,null,null,null,null,null,null,null,null,null,null,null,null,null,null,null,0,0,0,0,0,0,0,0,0,0,0,0,0,null,null,null,null,null,null,null,null,null,null,null,0,0,"E",null,null,null,null,null,null,null,null,null,null,0,0,"E",null,null,null,null,null,null,null,null,null,0,0,"E",null,null,null,null,null,null,null,null,null,null,null,0,0,"E",null,null,null,null,null,null,null,null,null,null,null,0,0,"E",null,null,null,null,null,null,null,null,null,null,0,0,"E",null,null,null,null,null,null,null,null,0,null,0,"E",null,null,null,null,null,null,null,null,null,0,null,0,"E",null,null,null,null,null,null,null,null,null,0,null,0,"E","---","ERR","","----"]
[null,467,null,null,null,null,null,null,null,null,null,null,null,null,null,null,null,null,null,null,null,null,null,null,null,null,null,null,null,null,null,null,0,0,0,0,0,0,0,0,0,0,0,0,0,null,null,null,null,null,null,null,null,null,null,null,0,0,"E",null,null,null,null,null,null,null,null,null,null,0,0,"E",null,null,null,null,null,null,null,null,null,0,0,"E",null,null,null,null,null,null,null,null,null,null,null,0,0,"E",null,null,null,null,null,null,null,null,null,null,null,0,0,"E",null,null,null,null,null,null,null,null,null,null,0,0,"E",null,null,null,null,null,null,null,null,0,null,0,"E",null,null,null,null,null,null,null,null,null,0,null,0,"E",null,null,null,null,null,null,null,null,null,0,null,0,"E","---","ERR","","----"]
[null,468,null,null,null,null,null,null,null,null,null,null,null,null,null,null,null,null,null,null,null,null,null,null,null,null,null,null,null,null,null,null,0,0,0,0,0,0,0,0,0,0,0,0,0,null,null,null,null,null,null,null,null,null,null,null,0,0,"E",null,null,null,null,null,null,null,null,null,null,0,0,"E",null,null,null,null,null,null,null,null,null,0,0,"E",null,null,null,null,null,null,null,null,null,null,null,0,0,"E",null,null,null,null,null,null,null,null,null,null,null,0,0,"E",null,null,null,null,null,null,null,null,null,null,0,0,"E",null,null,null,null,null,null,null,null,0,null,0,"E",null,null,null,null,null,null,null,null,null,0,null,0,"E",null,null,null,null,null,null,null,null,null,0,null,0,"E","---","ERR","","----"]
[null,469,null,null,null,null,null,null,null,null,null,null,null,null,null,null,null,null,null,null,null,null,null,null,null,null,null,null,null,null,null,null,0,0,0,0,0,0,0,0,0,0,0,0,0,null,null,null,null,null,null,null,null,null,null,null,0,0,"E",null,null,null,null,null,null,null,null,null,null,0,0,"E",null,null,null,null,null,null,null,null,null,0,0,"E",null,null,null,null,null,null,null,null,null,null,null,0,0,"E",null,null,null,null,null,null,null,null,null,null,null,0,0,"E",null,null,null,null,null,null,null,null,null,null,0,0,"E",null,null,null,null,null,null,null,null,0,null,0,"E",null,null,null,null,null,null,null,null,null,0,null,0,"E",null,null,null,null,null,null,null,null,null,0,null,0,"E","---","ERR","","----"]
[null,470,null,null,null,null,null,null,null,null,null,null,null,null,null,null,null,null,null,null,null,null,null,null,null,null,null,null,null,null,null,null,0,0,0,0,0,0,0,0,0,0,0,0,0,null,null,null,null,null,null,null,null,null,null,null,0,0,"E",null,null,null,null,null,null,null,null,null,null,0,0,"E",null,null,null,null,null,null,null,null,null,0,0,"E",null,null,null,null,null,null,null,null,null,null,null,0,0,"E",null,null,null,null,null,null,null,null,null,null,null,0,0,"E",null,null,null,null,null,null,null,null,null,null,0,0,"E",null,null,null,null,null,null,null,null,0,null,0,"E",null,null,null,null,null,null,null,null,null,0,null,0,"E",null,null,null,null,null,null,null,null,null,0,null,0,"E","---","ERR","","----"]
[null,471,null,null,null,null,null,null,null,null,null,null,null,null,null,null,null,null,null,null,null,null,null,null,null,null,null,null,null,null,null,null,0,0,0,0,0,0,0,0,0,0,0,0,0,null,null,null,null,null,null,null,null,null,null,null,0,0,"E",null,null,null,null,null,null,null,null,null,null,0,0,"E",null,null,null,null,null,null,null,null,null,0,0,"E",null,null,null,null,null,null,null,null,null,null,null,0,0,"E",null,null,null,null,null,null,null,null,null,null,null,0,0,"E",null,null,null,null,null,null,null,null,null,null,0,0,"E",null,null,null,null,null,null,null,null,0,null,0,"E",null,null,null,null,null,null,null,null,null,0,null,0,"E",null,null,null,null,null,null,null,null,null,0,null,0,"E","---","ERR","","----"]
[null,472,null,null,null,null,null,null,null,null,null,null,null,null,null,null,null,null,null,null,null,null,null,null,null,null,null,null,null,null,null,null,0,0,0,0,0,0,0,0,0,0,0,0,0,null,null,null,null,null,null,null,null,null,null,null,0,0,"E",null,null,null,null,null,null,null,null,null,null,0,0,"E",null,null,null,null,null,null,null,null,null,0,0,"E",null,null,null,null,null,null,null,null,null,null,null,0,0,"E",null,null,null,null,null,null,null,null,null,null,null,0,0,"E",null,null,null,null,null,null,null,null,null,null,0,0,"E",null,null,null,null,null,null,null,null,0,null,0,"E",null,null,null,null,null,null,null,null,null,0,null,0,"E",null,null,null,null,null,null,null,null,null,0,null,0,"E","---","ERR","","----"]
[null,473,null,null,null,null,null,null,null,null,null,null,null,null,null,null,null,null,null,null,null,null,null,null,null,null,null,null,null,null,null,null,0,0,0,0,0,0,0,0,0,0,0,0,0,null,null,null,null,null,null,null,null,null,null,null,0,0,"E",null,null,null,null,null,null,null,null,null,null,0,0,"E",null,null,null,null,null,null,null,null,null,0,0,"E",null,null,null,null,null,null,null,null,null,null,null,0,0,"E",null,null,null,null,null,null,null,null,null,null,null,0,0,"E",null,null,null,null,null,null,null,null,null,null,0,0,"E",null,null,null,null,null,null,null,null,0,null,0,"E",null,null,null,null,null,null,null,null,null,0,null,0,"E",null,null,null,null,null,null,null,null,null,0,null,0,"E","---","ERR","","----"]
[null,474,null,null,null,null,null,null,null,null,null,null,null,null,null,null,null,null,null,null,null,null,null,null,null,null,null,null,null,null,null,null,0,0,0,0,0,0,0,0,0,0,0,0,0,null,null,null,null,null,null,null,null,null,null,null,0,0,"E",null,null,null,null,null,null,null,null,null,null,0,0,"E",null,null,null,null,null,null,null,null,null,0,0,"E",null,null,null,null,null,null,null,null,null,null,null,0,0,"E",null,null,null,null,null,null,null,null,null,null,null,0,0,"E",null,null,null,null,null,null,null,null,null,null,0,0,"E",null,null,null,null,null,null,null,null,0,null,0,"E",null,null,null,null,null,null,null,null,null,0,null,0,"E",null,null,null,null,null,null,null,null,null,0,null,0,"E","---","ERR","","----"]
[null,475,null,null,null,null,null,null,null,null,null,null,null,null,null,null,null,null,null,null,null,null,null,null,null,null,null,null,null,null,null,null,0,0,0,0,0,0,0,0,0,0,0,0,0,null,null,null,null,null,null,null,null,null,null,null,0,0,"E",null,null,null,null,null,null,null,null,null,null,0,0,"E",null,null,null,null,null,null,null,null,null,0,0,"E",null,null,null,null,null,null,null,null,null,null,null,0,0,"E",null,null,null,null,null,null,null,null,null,null,null,0,0,"E",null,null,null,null,null,null,null,null,null,null,0,0,"E",null,null,null,null,null,null,null,null,0,null,0,"E",null,null,null,null,null,null,null,null,null,0,null,0,"E",null,null,null,null,null,null,null,null,null,0,null,0,"E","---","ERR","","----"]
[null,476,null,null,null,null,null,null,null,null,null,null,null,null,null,null,null,null,null,null,null,null,null,null,null,null,null,null,null,null,null,null,0,0,0,0,0,0,0,0,0,0,0,0,0,null,null,null,null,null,null,null,null,null,null,null,0,0,"E",null,null,null,null,null,null,null,null,null,null,0,0,"E",null,null,null,null,null,null,null,null,null,0,0,"E",null,null,null,null,null,null,null,null,null,null,null,0,0,"E",null,null,null,null,null,null,null,null,null,null,null,0,0,"E",null,null,null,null,null,null,null,null,null,null,0,0,"E",null,null,null,null,null,null,null,null,0,null,0,"E",null,null,null,null,null,null,null,null,null,0,null,0,"E",null,null,null,null,null,null,null,null,null,0,null,0,"E","---","ERR","","----"]
[null,477,null,null,null,null,null,null,null,null,null,null,null,null,null,null,null,null,null,null,null,null,null,null,null,null,null,null,null,null,null,null,0,0,0,0,0,0,0,0,0,0,0,0,0,null,null,null,null,null,null,null,null,null,null,null,0,0,"E",null,null,null,null,null,null,null,null,null,null,0,0,"E",null,null,null,null,null,null,null,null,null,0,0,"E",null,null,null,null,null,null,null,null,null,null,null,0,0,"E",null,null,null,null,null,null,null,null,null,null,null,0,0,"E",null,null,null,null,null,null,null,null,null,null,0,0,"E",null,null,null,null,null,null,null,null,0,null,0,"E",null,null,null,null,null,null,null,null,null,0,null,0,"E",null,null,null,null,null,null,null,null,null,0,null,0,"E","---","ERR","","----"]
[null,478,null,null,null,null,null,null,null,null,null,null,null,null,null,null,null,null,null,null,null,null,null,null,null,null,null,null,null,null,null,null,0,0,0,0,0,0,0,0,0,0,0,0,0,null,null,null,null,null,null,null,null,null,null,null,0,0,"E",null,null,null,null,null,null,null,null,null,null,0,0,"E",null,null,null,null,null,null,null,null,null,0,0,"E",null,null,null,null,null,null,null,null,null,null,null,0,0,"E",null,null,null,null,null,null,null,null,null,null,null,0,0,"E",null,null,null,null,null,null,null,null,null,null,0,0,"E",null,null,null,null,null,null,null,null,0,null,0,"E",null,null,null,null,null,null,null,null,null,0,null,0,"E",null,null,null,null,null,null,null,null,null,0,null,0,"E","---","ERR","","----"]
[null,479,null,null,null,null,null,null,null,null,null,null,null,null,null,null,null,null,null,null,null,null,null,null,null,null,null,null,null,null,null,null,0,0,0,0,0,0,0,0,0,0,0,0,0,null,null,null,null,null,null,null,null,null,null,null,0,0,"E",null,null,null,null,null,null,null,null,null,null,0,0,"E",null,null,null,null,null,null,null,null,null,0,0,"E",null,null,null,null,null,null,null,null,null,null,null,0,0,"E",null,null,null,null,null,null,null,null,null,null,null,0,0,"E",null,null,null,null,null,null,null,null,null,null,0,0,"E",null,null,null,null,null,null,null,null,0,null,0,"E",null,null,null,null,null,null,null,null,null,0,null,0,"E",null,null,null,null,null,null,null,null,null,0,null,0,"E","---","ERR","","----"]
[null,480,null,null,null,null,null,null,null,null,null,null,null,null,null,null,null,null,null,null,null,null,null,null,null,null,null,null,null,null,null,null,0,0,0,0,0,0,0,0,0,0,0,0,0,null,null,null,null,null,null,null,null,null,null,null,0,0,"E",null,null,null,null,null,null,null,null,null,null,0,0,"E",null,null,null,null,null,null,null,null,null,0,0,"E",null,null,null,null,null,null,null,null,null,null,null,0,0,"E",null,null,null,null,null,null,null,null,null,null,null,0,0,"E",null,null,null,null,null,null,null,null,null,null,0,0,"E",null,null,null,null,null,null,null,null,0,null,0,"E",null,null,null,null,null,null,null,null,null,0,null,0,"E",null,null,null,null,null,null,null,null,null,0,null,0,"E","---","ERR","","----"]
[null,481,null,null,null,null,null,null,null,null,null,null,null,null,null,null,null,null,null,null,null,null,null,null,null,null,null,null,null,null,null,null,0,0,0,0,0,0,0,0,0,0,0,0,0,null,null,null,null,null,null,null,null,null,null,null,0,0,"E",null,null,null,null,null,null,null,null,null,null,0,0,"E",null,null,null,null,null,null,null,null,null,0,0,"E",null,null,null,null,null,null,null,null,null,null,null,0,0,"E",null,null,null,null,null,null,null,null,null,null,null,0,0,"E",null,null,null,null,null,null,null,null,null,null,0,0,"E",null,null,null,null,null,null,null,null,0,null,0,"E",null,null,null,null,null,null,null,null,null,0,null,0,"E",null,null,null,null,null,null,null,null,null,0,null,0,"E","---","ERR","","----"]
[null,482,null,null,null,null,null,null,null,null,null,null,null,null,null,null,null,null,null,null,null,null,null,null,null,null,null,null,null,null,null,null,0,0,0,0,0,0,0,0,0,0,0,0,0,null,null,null,null,null,null,null,null,null,null,null,0,0,"E",null,null,null,null,null,null,null,null,null,null,0,0,"E",null,null,null,null,null,null,null,null,null,0,0,"E",null,null,null,null,null,null,null,null,null,null,null,0,0,"E",null,null,null,null,null,null,null,null,null,null,null,0,0,"E",null,null,null,null,null,null,null,null,null,null,0,0,"E",null,null,null,null,null,null,null,null,0,null,0,"E",null,null,null,null,null,null,null,null,null,0,null,0,"E",null,null,null,null,null,null,null,null,null,0,null,0,"E","---","ERR","","----"]
[null,483,null,null,null,null,null,null,null,null,null,null,null,null,null,null,null,null,null,null,null,null,null,null,null,null,null,null,null,null,null,null,0,0,0,0,0,0,0,0,0,0,0,0,0,null,null,null,null,null,null,null,null,null,null,null,0,0,"E",null,null,null,null,null,null,null,null,null,null,0,0,"E",null,null,null,null,null,null,null,null,null,0,0,"E",null,null,null,null,null,null,null,null,null,null,null,0,0,"E",null,null,null,null,null,null,null,null,null,null,null,0,0,"E",null,null,null,null,null,null,null,null,null,null,0,0,"E",null,null,null,null,null,null,null,null,0,null,0,"E",null,null,null,null,null,null,null,null,null,0,null,0,"E",null,null,null,null,null,null,null,null,null,0,null,0,"E","---","ERR","","----"]
[null,484,null,null,null,null,null,null,null,null,null,null,null,null,null,null,null,null,null,null,null,null,null,null,null,null,null,null,null,null,null,null,0,0,0,0,0,0,0,0,0,0,0,0,0,null,null,null,null,null,null,null,null,null,null,null,0,0,"E",null,null,null,null,null,null,null,null,null,null,0,0,"E",null,null,null,null,null,null,null,null,null,0,0,"E",null,null,null,null,null,null,null,null,null,null,null,0,0,"E",null,null,null,null,null,null,null,null,null,null,null,0,0,"E",null,null,null,null,null,null,null,null,null,null,0,0,"E",null,null,null,null,null,null,null,null,0,null,0,"E",null,null,null,null,null,null,null,null,null,0,null,0,"E",null,null,null,null,null,null,null,null,null,0,null,0,"E","---","ERR","","----"]
[null,485,null,null,null,null,null,null,null,null,null,null,null,null,null,null,null,null,null,null,null,null,null,null,null,null,null,null,null,null,null,null,0,0,0,0,0,0,0,0,0,0,0,0,0,null,null,null,null,null,null,null,null,null,null,null,0,0,"E",null,null,null,null,null,null,null,null,null,null,0,0,"E",null,null,null,null,null,null,null,null,null,0,0,"E",null,null,null,null,null,null,null,null,null,null,null,0,0,"E",null,null,null,null,null,null,null,null,null,null,null,0,0,"E",null,null,null,null,null,null,null,null,null,null,0,0,"E",null,null,null,null,null,null,null,null,0,null,0,"E",null,null,null,null,null,null,null,null,null,0,null,0,"E",null,null,null,null,null,null,null,null,null,0,null,0,"E","---","ERR","","----"]
[null,486,null,null,null,null,null,null,null,null,null,null,null,null,null,null,null,null,null,null,null,null,null,null,null,null,null,null,null,null,null,null,0,0,0,0,0,0,0,0,0,0,0,0,0,null,null,null,null,null,null,null,null,null,null,null,0,0,"E",null,null,null,null,null,null,null,null,null,null,0,0,"E",null,null,null,null,null,null,null,null,null,0,0,"E",null,null,null,null,null,null,null,null,null,null,null,0,0,"E",null,null,null,null,null,null,null,null,null,null,null,0,0,"E",null,null,null,null,null,null,null,null,null,null,0,0,"E",null,null,null,null,null,null,null,null,0,null,0,"E",null,null,null,null,null,null,null,null,null,0,null,0,"E",null,null,null,null,null,null,null,null,null,0,null,0,"E","---","ERR","","----"]
[null,487,null,null,null,null,null,null,null,null,null,null,null,null,null,null,null,null,null,null,null,null,null,null,null,null,null,null,null,null,null,null,0,0,0,0,0,0,0,0,0,0,0,0,0,null,null,null,null,null,null,null,null,null,null,null,0,0,"E",null,null,null,null,null,null,null,null,null,null,0,0,"E",null,null,null,null,null,null,null,null,null,0,0,"E",null,null,null,null,null,null,null,null,null,null,null,0,0,"E",null,null,null,null,null,null,null,null,null,null,null,0,0,"E",null,null,null,null,null,null,null,null,null,null,0,0,"E",null,null,null,null,null,null,null,null,0,null,0,"E",null,null,null,null,null,null,null,null,null,0,null,0,"E",null,null,null,null,null,null,null,null,null,0,null,0,"E","---","ERR","","----"]
[null,488,null,null,null,null,null,null,null,null,null,null,null,null,null,null,null,null,null,null,null,null,null,null,null,null,null,null,null,null,null,null,0,0,0,0,0,0,0,0,0,0,0,0,0,null,null,null,null,null,null,null,null,null,null,null,0,0,"E",null,null,null,null,null,null,null,null,null,null,0,0,"E",null,null,null,null,null,null,null,null,null,0,0,"E",null,null,null,null,null,null,null,null,null,null,null,0,0,"E",null,null,null,null,null,null,null,null,null,null,null,0,0,"E",null,null,null,null,null,null,null,null,null,null,0,0,"E",null,null,null,null,null,null,null,null,0,null,0,"E",null,null,null,null,null,null,null,null,null,0,null,0,"E",null,null,null,null,null,null,null,null,null,0,null,0,"E","---","ERR","","----"]
[null,489,null,null,null,null,null,null,null,null,null,null,null,null,null,null,null,null,null,null,null,null,null,null,null,null,null,null,null,null,null,null,0,0,0,0,0,0,0,0,0,0,0,0,0,null,null,null,null,null,null,null,null,null,null,null,0,0,"E",null,null,null,null,null,null,null,null,null,null,0,0,"E",null,null,null,null,null,null,null,null,null,0,0,"E",null,null,null,null,null,null,null,null,null,null,null,0,0,"E",null,null,null,null,null,null,null,null,null,null,null,0,0,"E",null,null,null,null,null,null,null,null,null,null,0,0,"E",null,null,null,null,null,null,null,null,0,null,0,"E",null,null,null,null,null,null,null,null,null,0,null,0,"E",null,null,null,null,null,null,null,null,null,0,null,0,"E","---","ERR","","----"]
[null,490,null,null,null,null,null,null,null,null,null,null,null,null,null,null,null,null,null,null,null,null,null,null,null,null,null,null,null,null,null,null,0,0,0,0,0,0,0,0,0,0,0,0,0,null,null,null,null,null,null,null,null,null,null,null,0,0,"E",null,null,null,null,null,null,null,null,null,null,0,0,"E",null,null,null,null,null,null,null,null,null,0,0,"E",null,null,null,null,null,null,null,null,null,null,null,0,0,"E",null,null,null,null,null,null,null,null,null,null,null,0,0,"E",null,null,null,null,null,null,null,null,null,null,0,0,"E",null,null,null,null,null,null,null,null,0,null,0,"E",null,null,null,null,null,null,null,null,null,0,null,0,"E",null,null,null,null,null,null,null,null,null,0,null,0,"E","---","ERR","","----"]
[null,491,null,null,null,null,null,null,null,null,null,null,null,null,null,null,null,null,null,null,null,null,null,null,null,null,null,null,null,null,null,null,0,0,0,0,0,0,0,0,0,0,0,0,0,null,null,null,null,null,null,null,null,null,null,null,0,0,"E",null,null,null,null,null,null,null,null,null,null,0,0,"E",null,null,null,null,null,null,null,null,null,0,0,"E",null,null,null,null,null,null,null,null,null,null,null,0,0,"E",null,null,null,null,null,null,null,null,null,null,null,0,0,"E",null,null,null,null,null,null,null,null,null,null,0,0,"E",null,null,null,null,null,null,null,null,0,null,0,"E",null,null,null,null,null,null,null,null,null,0,null,0,"E",null,null,null,null,null,null,null,null,null,0,null,0,"E","---","ERR","","----"]
[null,492,null,null,null,null,null,null,null,null,null,null,null,null,null,null,null,null,null,null,null,null,null,null,null,null,null,null,null,null,null,null,0,0,0,0,0,0,0,0,0,0,0,0,0,null,null,null,null,null,null,null,null,null,null,null,0,0,"E",null,null,null,null,null,null,null,null,null,null,0,0,"E",null,null,null,null,null,null,null,null,null,0,0,"E",null,null,null,null,null,null,null,null,null,null,null,0,0,"E",null,null,null,null,null,null,null,null,null,null,null,0,0,"E",null,null,null,null,null,null,null,null,null,null,0,0,"E",null,null,null,null,null,null,null,null,0,null,0,"E",null,null,null,null,null,null,null,null,null,0,null,0,"E",null,null,null,null,null,null,null,null,null,0,null,0,"E","---","ERR","","----"]
[null,493,null,null,null,null,null,null,null,null,null,null,null,null,null,null,null,null,null,null,null,null,null,null,null,null,null,null,null,null,null,null,0,0,0,0,0,0,0,0,0,0,0,0,0,null,null,null,null,null,null,null,null,null,null,null,0,0,"E",null,null,null,null,null,null,null,null,null,null,0,0,"E",null,null,null,null,null,null,null,null,null,0,0,"E",null,null,null,null,null,null,null,null,null,null,null,0,0,"E",null,null,null,null,null,null,null,null,null,null,null,0,0,"E",null,null,null,null,null,null,null,null,null,null,0,0,"E",null,null,null,null,null,null,null,null,0,null,0,"E",null,null,null,null,null,null,null,null,null,0,null,0,"E",null,null,null,null,null,null,null,null,null,0,null,0,"E","---","ERR","","----"]
[null,494,null,null,null,null,null,null,null,null,null,null,null,null,null,null,null,null,null,null,null,null,null,null,null,null,null,null,null,null,null,null,0,0,0,0,0,0,0,0,0,0,0,0,0,null,null,null,null,null,null,null,null,null,null,null,0,0,"E",null,null,null,null,null,null,null,null,null,null,0,0,"E",null,null,null,null,null,null,null,null,null,0,0,"E",null,null,null,null,null,null,null,null,null,null,null,0,0,"E",null,null,null,null,null,null,null,null,null,null,null,0,0,"E",null,null,null,null,null,null,null,null,null,null,0,0,"E",null,null,null,null,null,null,null,null,0,null,0,"E",null,null,null,null,null,null,null,null,null,0,null,0,"E",null,null,null,null,null,null,null,null,null,0,null,0,"E","---","ERR","","----"]
[null,495,null,null,null,null,null,null,null,null,null,null,null,null,null,null,null,null,null,null,null,null,null,null,null,null,null,null,null,null,null,null,0,0,0,0,0,0,0,0,0,0,0,0,0,null,null,null,null,null,null,null,null,null,null,null,0,0,"E",null,null,null,null,null,null,null,null,null,null,0,0,"E",null,null,null,null,null,null,null,null,null,0,0,"E",null,null,null,null,null,null,null,null,null,null,null,0,0,"E",null,null,null,null,null,null,null,null,null,null,null,0,0,"E",null,null,null,null,null,null,null,null,null,null,0,0,"E",null,null,null,null,null,null,null,null,0,null,0,"E",null,null,null,null,null,null,null,null,null,0,null,0,"E",null,null,null,null,null,null,null,null,null,0,null,0,"E","---","ERR","","----"]
[null,496,null,null,null,null,null,null,null,null,null,null,null,null,null,null,null,null,null,null,null,null,null,null,null,null,null,null,null,null,null,null,0,0,0,0,0,0,0,0,0,0,0,0,0,null,null,null,null,null,null,null,null,null,null,null,0,0,"E",null,null,null,null,null,null,null,null,null,null,0,0,"E",null,null,null,null,null,null,null,null,null,0,0,"E",null,null,null,null,null,null,null,null,null,null,null,0,0,"E",null,null,null,null,null,null,null,null,null,null,null,0,0,"E",null,null,null,null,null,null,null,null,null,null,0,0,"E",null,null,null,null,null,null,null,null,0,null,0,"E",null,null,null,null,null,null,null,null,null,0,null,0,"E",null,null,null,null,null,null,null,null,null,0,null,0,"E","---","ERR","","----"]
[null,497,null,null,null,null,null,null,null,null,null,null,null,null,null,null,null,null,null,null,null,null,null,null,null,null,null,null,null,null,null,null,0,0,0,0,0,0,0,0,0,0,0,0,0,null,null,null,null,null,null,null,null,null,null,null,0,0,"E",null,null,null,null,null,null,null,null,null,null,0,0,"E",null,null,null,null,null,null,null,null,null,0,0,"E",null,null,null,null,null,null,null,null,null,null,null,0,0,"E",null,null,null,null,null,null,null,null,null,null,null,0,0,"E",null,null,null,null,null,null,null,null,null,null,0,0,"E",null,null,null,null,null,null,null,null,0,null,0,"E",null,null,null,null,null,null,null,null,null,0,null,0,"E",null,null,null,null,null,null,null,null,null,0,null,0,"E","---","ERR","","----"]
[null,498,null,null,null,null,null,null,null,null,null,null,null,null,null,null,null,null,null,null,null,null,null,null,null,null,null,null,null,null,null,null,0,0,0,0,0,0,0,0,0,0,0,0,0,null,null,null,null,null,null,null,null,null,null,null,0,0,"E",null,null,null,null,null,null,null,null,null,null,0,0,"E",null,null,null,null,null,null,null,null,null,0,0,"E",null,null,null,null,null,null,null,null,null,null,null,0,0,"E",null,null,null,null,null,null,null,null,null,null,null,0,0,"E",null,null,null,null,null,null,null,null,null,null,0,0,"E",null,null,null,null,null,null,null,null,0,null,0,"E",null,null,null,null,null,null,null,null,null,0,null,0,"E",null,null,null,null,null,null,null,null,null,0,null,0,"E","---","ERR","","----"]
[null,499,null,null,null,null,null,null,null,null,null,null,null,null,null,null,null,null,null,null,null,null,null,null,null,null,null,null,null,null,null,null,0,0,0,0,0,0,0,0,0,0,0,0,0,null,null,null,null,null,null,null,null,null,null,null,0,0,"E",null,null,null,null,null,null,null,null,null,null,0,0,"E",null,null,null,null,null,null,null,null,null,0,0,"E",null,null,null,null,null,null,null,null,null,null,null,0,0,"E",null,null,null,null,null,null,null,null,null,null,null,0,0,"E",null,null,null,null,null,null,null,null,null,null,0,0,"E",null,null,null,null,null,null,null,null,0,null,0,"E",null,null,null,null,null,null,null,null,null,0,null,0,"E",null,null,null,null,null,null,null,null,null,0,null,0,"E","---","ERR","","----"]
[null,500,null,null,null,null,null,null,null,null,null,null,null,null,null,null,null,null,null,null,null,null,null,null,null,null,null,null,null,null,null,null,0,0,0,0,0,0,0,0,0,0,0,0,0,null,null,null,null,null,null,null,null,null,null,null,0,0,"E",null,null,null,null,null,null,null,null,null,null,0,0,"E",null,null,null,null,null,null,null,null,null,0,0,"E",null,null,null,null,null,null,null,null,null,null,null,0,0,"E",null,null,null,null,null,null,null,null,null,null,null,0,0,"E",null,null,null,null,null,null,null,null,null,null,0,0,"E",null,null,null,null,null,null,null,null,0,null,1,1,null,null,null,null,null,null,null,null,null,0,null,1,1,null,null,null,null,null,null,null,null,null,0,null,0,"E","---","ERR","","----"]

{"sheet":"Holistic Card Print","index":2,"n_rows":999,"n_cols":36,"rows_kept":999,"cut":false,"hidden":false,"merged":[[26,1,26,7],[26,8,26,22],[20,14,20,15],[4,14,4,15],[19,8,19,13],[17,12,17,19],[17,9,17,11],[13,16,13,18],[13,19,13,22],[19,20,19,22],[11,11,11,13],[11,14,11,18],[11,8,11,10],[10,14,10,16],[7,8,7,18],[7,19,11,22],[25,21,25,22],[23,1,23,7],[24,1,24,7],[25,1,25,7],[19,1,19,7],[19,14,19,19],[20,16,20,22],[20,1,20,7],[25,14,25,15],[25,18,25,19],[22,1,22,7],[22,21,22,22],[22,18,22,19],[23,18,23,19],[24,18,24,19],[23,21,23,22],[24,21,24,22],[8,1,8,7],[10,1,10,7],[11,1,11,7],[12,1,12,7],[12,8,12,22],[13,8,13,15],[6,1,6,22],[21,1,21,22],[8,8,8,11],[8,12,8,15],[8,16,8,18],[18,20,18,22],[13,1,13,7],[14,1,14,7],[14,8,14,22],[10,8,10,9],[10,11,10,12],[15,20,15,22],[17,20,17,22],[15,12,15,19],[20,12,20,13],[20,8,20,9],[15,1,15,7],[15,8,15,11],[32,1,32,22],[31,1,31,22],[34,21,34,22],[34,19,34,20],[34,5,34,6],[34,1,34,4],[1,1,1,22],[0,0,28,0],[0,1,0,23],[28,1,28,23],[26,23,27,23],[2,1,2,8],[2,9,2,22],[3,1,3,22],[24,14,24,15],[23,14,23,15],[22,14,22,15],[16,1,16,7],[16,8,16,22],[18,1,18,7],[18,8,18,15],[18,16,18,19],[4,1,4,5],[7,1,7,7],[53,1,53,6],[44,1,44,9],[44,10,44,22],[45,1,45,4],[45,5,45,6],[45,7,45,9],[45,10,45,18],[45,19,45,20],[45,21,45,22],[46,1,46,4],[46,5,46,6],[46,7,46,9],[46,10,46,18],[46,19,46,20],[46,21,46,22],[47,1,47,4],[47,5,47,6],[47,7,47,9],[47,10,47,18],[47,19,47,20],[47,21,47,22],[49,5,49,6],[49,7,49,9],[49,10,49,18],[80,1,80,4],[80,5,80,6],[64,1,64,22],[65,1,65,9],[65,10,65,22],[66,1,66,4],[66,5,66,6],[66,7,66,9],[66,10,66,18],[66,19,66,20],[66,21,66,22],[69,19,69,20],[69,21,69,22],[70,1,70,4],[70,5,70,6],[70,7,70,9],[70,10,70,18],[70,19,70,20],[70,21,70,22],[67,19,67,20],[67,21,67,22],[68,1,68,4],[68,5,68,6],[68,7,68,9],[40,19,40,20],[35,10,35,18],[42,19,42,20],[42,21,42,22],[34,10,34,18],[36,10,36,18],[36,1,36,4],[37,1,37,4],[38,1,38,4],[39,1,39,4],[40,1,40,4],[35,1,35,4],[41,1,41,6],[41,7,41,11],[42,1,42,6],[39,5,39,6],[40,5,40,6],[37,5,37,6],[38,5,38,6],[35,5,35,6],[36,5,36,6],[39,10,39,18],[40,10,40,18],[37,21,37,22],[38,21,38,22],[39,21,39,22],[37,10,37,18],[38,10,38,18],[35,19,35,20],[36,19,36,20],[37,19,37,20],[38,19,38,20],[39,19,39,20],[48,7,48,9],[48,10,48,18],[48,19,48,20],[53,7,53,11],[53,12,53,18],[53,19,53,20],[53,21,53,22],[33,1,33,9],[33,10,33,22],[42,7,42,11],[42,12,42,18],[34,7,34,9],[35,7,35,9],[36,7,36,9],[37,7,37,9],[38,7,38,9],[39,7,39,9],[40,7,40,9],[40,21,40,22],[41,21,41,22],[41,19,41,20],[41,12,41,18],[35,21,35,22],[36,21,36,22],[43,1,43,22],[52,1,52,6],[52,7,52,11],[52,12,52,18],[52,19,52,20],[52,21,52,22],[50,21,50,22],[51,1,51,4],[51,5,51,6],[51,7,51,9],[51,10,51,18],[51,19,51,20],[51,21,51,22],[50,1,50,4],[50,5,50,6],[50,7,50,9],[50,10,50,18],[50,19,50,20],[48,21,48,22],[49,1,49,4],[49,19,49,20],[49,21,49,22],[48,1,48,4],[48,5,48,6],[57,19,57,20],[57,21,57,22],[58,1,58,4],[58,5,58,6],[58,7,58,9],[58,10,58,18],[58,19,58,20],[58,21,58,22],[54,1,54,22],[55,1,55,9],[55,10,55,22],[56,1,56,4],[56,5,56,6],[56,7,56,9],[56,10,56,18],[56,19,56,20],[56,21,56,22],[57,1,57,4],[57,5,57,6],[57,7,57,9],[57,10,57,18],[61,1,61,4],[61,5,61,6],[61,7,61,9],[61,10,61,18],[61,19,61,20],[61,21,61,22],[59,19,59,20],[59,21,59,22],[60,1,60,4],[60,5,60,6],[60,7,60,9],[60,10,60,18],[60,19,60,20],[60,21,60,22],[59,1,59,4],[59,5,59,6],[59,7,59,9],[59,10,59,18],[63,1,63,6],[63,7,63,11],[63,12,63,18],[63,19,63,20],[63,21,63,22],[62,1,62,6],[62,7,62,11],[62,12,62,18],[62,19,62,20],[62,21,62,22],[68,10,68,18],[68,19,68,20],[68,21,68,22],[69,1,69,4],[69,5,69,6],[69,7,69,9],[69,10,69,18],[67,1,67,4],[67,5,67,6],[67,7,67,9],[67,10,67,18],[74,1,74,6],[74,7,74,11],[74,12,74,18],[74,19,74,20],[74,21,74,22],[71,19,71,20],[71,21,71,22],[73,1,73,4],[73,5,73,6],[73,7,73,9],[73,10,73,18],[73,19,73,20],[73,21,73,22],[72,1,72,4],[72,5,72,6],[72,7,72,9],[72,10,72,18],[72,19,72,20],[72,21,72,22],[71,1,71,4],[71,5,71,6],[71,7,71,9],[71,10,71,18],[81,19,81,20],[81,21,81,22],[82,1,82,4],[82,5,82,6],[82,7,82,9],[82,10,82,18],[82,19,82,20],[82,21,82,22],[75,1,75,6],[75,7,75,11],[75,12,75,18],[75,19,75,20],[75,21,75,22],[80,7,80,9],[80,10,80,18],[80,19,80,20],[80,21,80,22],[78,1,78,22],[81,1,81,4],[81,5,81,6],[81,7,81,9],[81,10,81,18],[79,1,79,9],[79,10,79,22],[85,19,85,20],[85,21,85,22],[86,1,86,4],[86,5,86,6],[86,7,86,9],[86,10,86,18],[86,19,86,20],[86,21,86,22],[83,19,83,20],[83,21,83,22],[84,1,84,4],[84,5,84,6],[84,7,84,9],[84,10,84,18],[84,19,84,20],[84,21,84,22],[85,1,85,4],[85,5,85,6],[85,7,85,9],[85,10,85,18],[83,1,83,4],[83,5,83,6],[83,7,83,9],[83,10,83,18],[89,1,89,6],[89,7,89,11],[89,12,89,18],[89,19,89,20],[89,21,89,22],[87,21,87,22],[88,1,88,6],[88,7,88,11],[88,12,88,18],[88,19,88,20],[88,21,88,22],[87,1,87,4],[87,5,87,6],[87,7,87,9],[87,10,87,18],[87,19,87,20],[90,1,90,22],[91,1,91,9],[91,10,91,22],[92,1,92,4],[92,5,92,6],[92,7,92,9],[92,10,92,18],[92,19,92,20],[92,21,92,22],[93,21,93,22],[94,1,94,4],[94,5,94,6],[94,7,94,9],[94,10,94,18],[94,19,94,20],[94,21,94,22],[93,1,93,4],[93,5,93,6],[93,7,93,9],[93,10,93,18],[93,19,93,20],[97,21,97,22],[97,1,97,4],[97,5,97,6],[97,7,97,9],[97,10,97,18],[97,19,97,20],[95,21,95,22],[96,1,96,4],[96,5,96,6],[96,7,96,9],[96,10,96,18],[96,19,96,20],[96,21,96,22],[95,1,95,4],[95,5,95,6],[95,7,95,9],[95,10,95,18],[95,19,95,20],[100,1,100,6],[100,7,100,11],[100,12,100,18],[100,19,100,20],[100,21,100,22],[98,21,98,22],[99,1,99,6],[99,7,99,11],[99,12,99,18],[99,19,99,20],[99,21,99,22],[98,1,98,4],[98,5,98,6],[98,7,98,9],[98,10,98,18],[98,19,98,20],[101,1,101,22],[102,1,102,9],[102,10,102,22],[103,1,103,4],[103,5,103,6],[103,7,103,9],[103,10,103,18],[103,19,103,20],[103,21,103,22],[104,21,104,22],[105,1,105,4],[105,5,105,6],[105,7,105,9],[105,10,105,18],[105,19,105,20],[105,21,105,22],[104,1,104,4],[104,5,104,6],[104,7,104,9],[104,10,104,18],[104,19,104,20],[106,21,106,22],[107,1,107,4],[107,5,107,6],[107,7,107,9],[107,21,107,22],[106,1,106,4],[106,5,106,6],[106,7,106,9],[106,10,106,18],[106,19,106,20],[109,19,109,20],[109,21,109,22],[109,1,109,4],[109,5,109,6],[109,7,109,9],[109,10,109,13],[109,14,109,18],[108,21,108,22],[107,10,107,18],[107,19,107,20],[108,1,108,4],[108,5,108,6],[108,7,108,9],[108,10,108,18],[108,19,108,20],[111,1,111,22],[112,1,112,9],[112,10,112,22],[113,1,113,4],[113,5,113,6],[113,7,113,9],[113,10,113,18],[110,19,110,20],[110,21,110,22],[110,1,110,4],[110,5,110,6],[110,7,110,9],[110,10,110,13],[110,14,110,18],[113,19,113,20],[113,21,113,22],[125,1,125,4],[125,5,125,6],[125,7,125,9],[125,10,125,18],[125,19,125,20],[123,21,123,22],[124,1,124,4],[124,5,124,6],[124,7,124,9],[124,10,124,18],[124,19,124,20],[124,21,124,22],[123,1,123,4],[123,5,123,6],[123,7,123,9],[123,10,123,18],[123,19,123,20],[114,1,114,4],[114,5,114,6],[114,7,114,9],[114,10,114,18],[114,19,114,20],[114,21,114,22],[129,1,129,6],[129,19,129,20],[129,21,129,22],[129,7,129,9],[129,10,129,13],[129,14,129,18],[127,21,127,22],[128,19,128,20],[128,21,128,22],[127,1,127,4],[127,5,127,6],[127,7,127,9],[127,10,127,18],[127,19,127,20],[125,21,125,22],[126,1,126,4],[115,21,115,22],[116,1,116,4],[116,5,116,6],[116,7,116,9],[116,10,116,18],[116,19,116,20],[116,21,116,22],[115,1,115,4],[115,5,115,6],[115,7,115,9],[115,10,115,18],[115,19,115,20],[117,21,117,22],[118,1,118,4],[118,5,118,6],[118,7,118,9],[118,10,118,18],[118,19,118,20],[118,21,118,22],[117,1,117,4],[117,5,117,6],[117,7,117,9],[117,10,117,18],[117,19,117,20],[121,1,121,22],[122,1,122,9],[122,10,122,22],[128,1,128,4],[128,5,128,6],[128,7,128,9],[128,10,128,18],[119,19,119,20],[119,21,119,22],[120,7,120,9],[120,10,120,13],[120,14,120,18],[120,19,120,20],[120,21,120,22],[119,1,119,6],[120,1,120,6],[119,7,119,9],[119,10,119,13],[119,14,119,18],[126,5,126,6],[126,7,126,9],[126,10,126,18],[126,19,126,20],[126,21,126,22],[130,21,130,22],[132,17,132,22],[131,1,131,22],[132,1,132,6],[132,7,132,11],[132,12,132,16],[130,1,130,6],[130,7,130,9],[130,10,130,13],[130,14,130,18],[130,19,130,20],[141,17,141,18],[141,19,141,20],[141,21,141,22],[135,17,135,18],[135,19,135,20],[135,21,135,22],[133,1,133,6],[133,17,133,22],[134,1,134,22],[135,1,135,16],[136,1,136,22],[137,1,137,22],[138,1,138,16],[139,1,139,16],[140,1,140,16],[141,1,141,16],[133,12,133,16],[133,7,133,11],[138,17,138,18],[138,19,138,20],[138,21,138,22],[139,17,139,18],[140,17,140,18],[139,19,139,20],[142,1,142,22],[145,17,145,18],[143,19,143,20],[144,19,144,20],[145,19,145,20],[152,19,152,20],[153,19,153,20],[154,19,154,20],[150,17,150,18],[148,19,148,20],[149,19,149,20],[150,19,150,20],[148,21,148,22],[149,21,149,22],[150,21,150,22],[153,21,153,22],[154,21,154,22],[143,1,143,16],[144,1,144,16],[145,1,145,16],[148,1,148,16],[149,1,149,16],[150,1,150,16],[152,1,152,16],[143,21,143,22],[144,21,144,22],[145,21,145,22],[148,17,148,18],[149,17,149,18],[143,17,143,18],[144,17,144,18],[173,1,173,22],[172,17,172,18],[172,19,172,20],[172,21,172,22],[172,1,172,16],[171,1,171,16],[171,21,171,22],[167,19,167,20],[160,21,160,22],[166,21,166,22],[167,21,167,22],[166,17,166,18],[167,17,167,18],[158,19,158,20],[159,19,159,20],[160,19,160,20],[161,19,161,20],[140,19,140,20],[139,21,139,22],[140,21,140,22],[155,1,155,22],[156,1,156,22],[157,19,157,20],[153,1,153,16],[154,1,154,16],[170,1,170,16],[168,1,168,22],[169,1,169,16],[166,1,166,16],[167,1,167,16],[164,1,164,16],[165,1,165,16],[147,1,147,22],[146,1,146,22],[157,1,157,16],[158,1,158,16],[169,21,169,22],[170,21,170,22],[164,19,164,20],[165,19,165,20],[166,19,166,20],[151,1,151,22],[152,17,152,18],[152,21,152,22],[162,21,162,22],[164,17,164,18],[165,17,165,18],[164,21,164,22],[165,21,165,22],[160,17,160,18],[161,17,161,18],[162,17,162,18],[163,1,163,22],[162,1,162,16],[160,1,160,16],[161,1,161,16],[159,1,159,16],[157,17,157,18],[158,17,158,18],[159,17,159,18],[157,21,157,22],[158,21,158,22],[159,21,159,22],[182,1,185,3],[182,4,182,22],[183,4,183,22],[184,4,184,22],[185,4,185,22],[186,4,186,22],[181,1,181,3],[162,19,162,20],[161,21,161,22],[176,21,176,22],[177,21,177,22],[178,21,178,22],[174,19,174,20],[175,19,175,20],[178,1,178,16],[179,1,179,16],[176,1,176,16],[177,1,177,16],[174,21,174,22],[175,21,175,22],[175,17,175,18],[176,17,176,18],[177,17,177,18],[178,17,178,18],[179,21,179,22],[181,4,181,22],[153,17,153,18],[154,17,154,18],[179,17,179,18],[190,1,193,3],[180,1,180,22],[188,4,188,22],[189,4,189,22],[190,4,190,22],[191,4,191,22],[192,4,192,22],[193,4,193,22],[17,1,17,7],[186,1,189,3],[174,1,174,16],[175,1,175,16],[187,4,187,22],[169,17,169,18],[170,17,170,18],[171,17,171,18],[169,19,169,20],[170,19,170,20],[171,19,171,20],[176,19,176,20],[177,19,177,20],[178,19,178,20],[179,19,179,20],[174,17,174,18],[198,26,198,31],[196,10,196,16],[197,10,197,16],[198,10,198,16],[200,0,200,22],[199,1,199,22],[194,1,194,22],[196,1,196,3],[197,1,197,3],[198,1,198,3],[196,4,196,9],[196,17,196,22],[197,4,197,9],[197,17,197,22],[198,4,198,9],[198,17,198,22],[195,1,195,3],[195,4,195,9],[195,10,195,16],[195,17,195,22]]}
[]
[null,"ਸਰਬਪੱਖੀ ਪ੍ਰਗਤੀ ਕਾਰਡ (2025-26)\n(HOLISTIC PROGRESS CARD 2025-26)\n(ਅੱਪਰ ਪ੍ਰਾਇਮਰੀ)",null,null,null,null,null,null,null,null,null,null,null,null,null,null,null,null,null,null,null,null,null,null,null,null,"Total Number of Record",{"$f":"COUNTA('Entry Sheet'!C7:C506)","v":2},null,null,null,null,null,null,null,1]
[null,"ਸਕੂਲ ਦਾ ਨਾਮ ਅਤੇ ਪਤਾ",null,null,null,null,null,null,null,{"$f":"'Entry Sheet'!D2","v":"srkwrI hweI skUL"},null,null,null,null,null,null,null,null,null,null,null,null,null,null,null,null,null,null,null,null,null,null,null,null,null,2]
[null,null,null,null,null,null,null,null,null,null,null,null,null,null,null,null,null,null,null,null,null,null,null,null,null,null,null,null,null,null,null,null,null,null,null,3]
[null,"UDISE Code :",null,null,null,null,{"$f":"'Entry Sheet'!D3","v":0},{"$f":"'Entry Sheet'!E3","v":3},{"$f":"'Entry Sheet'!F3","v":0},{"$f":"'Entry Sheet'!G3","v":9},{"$f":"'Entry Sheet'!H3","v":0},{"$f":"'Entry Sheet'!I3","v":4},{"$f":"'Entry Sheet'!J3","v":0},{"$f":"'Entry Sheet'!K3","v":1},{"$f":"'Entry Sheet'!L3","v":0},null,{"$f":"'Entry Sheet'!M3","v":0},{"$f":"'Entry Sheet'!N3","v":0},null,null,null,null,null,null,null,null,null,null,null,null,null,null,null,null,null,4]
[null,null,null,null,null,null,null,null,null,null,null,null,null,null,null,null,null,null,null,null,null,null,null,null,null,null,"Sr No. of Record",2,null,null,null,null,null,null,null,5]
[null,"ਵਿਦਿਆਰਥੀ ਦੇ ਆਮ ਵੇਰਵੇ",null,null,null,null,null,null,null,null,null,null,null,null,null,null,null,null,null,null,null,null,null,null,null,null,null,null,null,null,null,null,null,null,null,6]
[null,"ਨਾਮ:",null,null,null,null,null,null,{"$f":"IFERROR(VLOOKUP($AB$6,'Entry Sheet'!B7:$FL$500,2),\"\")","v":"sham"},null,null,null,null,null,null,null,null,null,null,"ਫੋਟੋ ",null,null,null,null,null,null,null,null,null,null,null,null,null,null,null,7]
[null,"ਰੋਲ ਨੰਬਰ :",null,null,null,null,null,null,{"$f":"IFERROR(VLOOKUP($AB$6,'Entry Sheet'!B7:$FL$500,3),\"\")","v":2},null,null,null,"ਰਜਿਸਟਰੇਸ਼ਨ/  \nਦਾਖਲਾ ਨੰ:",null,null,null,{"$f":"IFERROR(VLOOKUP($AB$6,'Entry Sheet'!B7:$FL$500,4),\"\")","v":0},null,null,null,null,null,null,null,null,null,null,null,null,null,null,null,null,null,null,8]
[null,null,null,null,null,null,null,null,null,null,{"$f":"IFERROR(VLOOKUP($AB$6,'Entry Sheet'!B7:$FL$500,5),\"\")","v":"7th"},null,null,null,null,null,null,null,null,null,null,null,null,null,null,null,null,null,null,null,null,null,null,null,null,9]
[null,"ਜਮਾਤ:",null,null,null,null,null,null,"ਗ੍ਰੇਡ 6",null,{"$f":"IF(K10=\"6th\",\"P\",\"\")","v":""},"ਗ੍ਰੇਡ 7",null,{"$f":"IF(K10=\"7th\",\"P\",\"\")","v":"P"},"ਗ੍ਰੇਡ 8",null,null,{"$f":"IF(K10=\"8th\",\"P\",\"\")","v":""},null,null,null,null,null,null,null,null,null,null,null,null,null,null,null,null,null,10]
[null,"ਸੈਕਸ਼ਨ:",null,null,null,null,null,null,{"$f":"IFERROR(VLOOKUP($AB$6,'Entry Sheet'!B7:$FL$500,6),\"\")","v":0},null,null,"ਜਨਮ ਮਿਤੀ ",null,null,{"$f":"IFERROR(VLOOKUP($AB$6,'Entry Sheet'!B7:$FL$500,7),\"\")","v":"2001-10-01"},null,null,null,null,null,null,null,null,null,null,null,null,null,null,null,null,null,null,null,null,11]
[null,"ਪਤਾ",null,null,null,null,null,null,{"$f":"IFERROR(VLOOKUP($AB$6,'Entry Sheet'!B7:$FL$500,8),\"\")","v":0},null,null,null,null,null,null,null,null,null,null,null,null,null,null,null,null,null,null,null,null,null,null,null,null,null,null,12]
[null,null,null,null,null,null,null,null,null,null,null,null,null,null,null,null,"ਫ਼ੋਨ   : ",null,null,{"$f":"IFERROR(VLOOKUP($AB$6,'Entry Sheet'!B7:$FL$500,9),\"\")","v":123456789},null,null,null,null,null,null,null,null,null,null,null,null,null,null,null,13]
[null,"ਮਾਤਾ ਸਰਪ੍ਰਸਤ ਦਾ ਨਾਮ:",null,null,null,null,null,null,{"$f":"IFERROR(VLOOKUP($AB$6,'Entry Sheet'!B7:$FL$500,10),\"\")","v":"sIqMU"},null,null,null,null,null,null,null,null,null,null,null,null,null,null,null,null,null,null,null,null,null,null,null,null,null,null,14]
[null,"ਮਾਤਾ ਸਰਪ੍ਰਸਤ ਦੀ ਵਿਦਿਅਕ ਯੋਗਤਾ:",null,null,null,null,null,null,{"$f":"IFERROR(VLOOKUP($AB$6,'Entry Sheet'!B7:$FL$500,11),\"\")","v":"8vI"},null,null,null,"ਮਾਤਾ/ਸਰਪ੍ਰਸਤ ਦਾ ਕਿੱਤਾ:",null,null,null,null,null,null,null,{"$f":"IFERROR(VLOOKUP($AB$6,'Entry Sheet'!B7:$FL$500,12),\"\")","v":0},null,null,null,null,null,null,null,null,null,null,null,null,null,null,15]
[null,"ਪਿਤਾ/ਸਰਪ੍ਰਸਤ ਦਾ ਨਾਮ:",null,null,null,null,null,null,{"$f":"IFERROR(VLOOKUP($AB$6,'Entry Sheet'!B7:$FL$500,13),\"\")","v":"kulj"},null,null,null,null,null,null,null,null,null,null,null,null,null,null,null,null,null,null,null,null,null,null,null,null,null,null,16]
[null,"ਪਿਤਾ/ਸਰਪ੍ਰਸਤ ਦੀ ਵਿਦਿਅਕ ਯੋਗਤਾ:",null,null,null,null,null,null,null,{"$f":"IFERROR(VLOOKUP($AB$6,'Entry Sheet'!B7:$FL$500,14),\"\")","v":"AnpV"},null,null,"ਪਿਤਾ/ਸਰਪ੍ਰਸਤ ਦਾ ਕਿੱਤਾ:",null,null,null,null,null,null,null,{"$f":"IFERROR(VLOOKUP($AB$6,'Entry Sheet'!B7:$FL$500,15),\"\")","v":0},null,null,null,null,null,null,null,null,null,null,null,null,null,null,17]
[null,"ਭੈਣ-ਭਰਾਵਾਂ ਦੀ ਗਿਣਤੀ :",null,null,null,null,null,null,{"$f":"IFERROR(VLOOKUP($AB$6,'Entry Sheet'!B7:$FL$500,16),\"\")","v":1},null,null,null,null,null,null,null,"ਭੈਣ-ਭਰਾਵਾਂ ਦੀ ਉਮਰ:",null,null,null,{"$f":"IFERROR(VLOOKUP($AB$6,'Entry Sheet'!B7:$FL$500,17),\"\")","v":10},null,null,null,null,null,null,null,null,null,null,null,null,null,null,18]
[null,"ਮਾਤ ਭਾਸ਼ਾ :",null,null,null,null,null,null,{"$f":"IFERROR(VLOOKUP($AB$6,'Entry Sheet'!B7:$FL$500,18),\"\")","v":0},null,null,null,null,null,"ਮਾਧਿਅਮ :",null,null,null,null,null,{"$f":"IFERROR(VLOOKUP($AB$6,'Entry Sheet'!B7:$FL$500,19),\"\")","v":0},null,null,null,null,null,null,null,null,null,null,null,null,null,null,19]
[null,"ਰਿਹਾਇਸ:",null,null,null,null,null,null,"ਪੇਡੂ ",null,{"$f":"IF(L21=\"Rural\",\"P\",\"\")","v":"P"},{"$f":"IFERROR(VLOOKUP($AB$6,'Entry Sheet'!B7:$FL$500,20),\"\")","v":"Rural"},"ਸ਼ਾਹਿਰੀ",null,{"$f":"IF(L21=\"Urban\",\"P\",\"\")","v":""},null,null,null,null,null,null,null,null,null,null,null,null,null,null,null,null,null,null,null,null,20]
[null,"ਹਾਜ਼ਰੀ :",null,null,null,null,null,null,null,null,null,null,null,null,null,null,null,null,null,null,null,null,null,null,null,null,null,null,null,null,null,null,null,null,null,21]
[null,"ਮਹੀਨਾ ",null,null,null,null,null,null,"ਅਪ੍ਰੈਲ "," ਮਈ ","ਜੁਲਾਈ","ਅਗਸਤ","ਸਤੰਬਰ ","ਅਕਤੂਬਰ","ਨਵੰਬਰ ",null,"ਦਸੰਬਰ","ਜਨਵਰੀ","ਫਰਵਰੀ",null,"ਮਾਰਚ","ਕੁੱਲ ਹਾਜ਼ਰੀ",null,null,null,null,null,null,null,null,null,null,null,null,null,22]
[null,"ਮਹੀਨੇ ਚ ਸਕੂਲ ਖੁੱਲਣ ਕੁੱਲ ਦਿਨ ",null,null,null,null,null,null,{"$f":"'Entry Sheet'!V4","v":25},{"$f":"'Entry Sheet'!W4","v":30},{"$f":"'Entry Sheet'!X4","v":30},{"$f":"'Entry Sheet'!Y4","v":30},{"$f":"'Entry Sheet'!Z4","v":30},{"$f":"'Entry Sheet'!AA4","v":30},{"$f":"'Entry Sheet'!AB4","v":30},null,{"$f":"'Entry Sheet'!AC4","v":30},{"$f":"'Entry Sheet'!AD4","v":30},{"$f":"'Entry Sheet'!AE4","v":30},null,{"$f":"'Entry Sheet'!AF4","v":30},{"$f":"'Entry Sheet'!AG4","v":325},null,null,null,null,null,null,null,null,null,null,null,null,null,23]
[null,"ਕੁੱਲ ਹਾਜਰੀਆ ",null,null,null,null,null,null,{"$f":"IFERROR(VLOOKUP($AB$6,'Entry Sheet'!B7:$FL$500,21),\"\")","v":23},{"$f":"IFERROR(VLOOKUP($AB$6,'Entry Sheet'!B7:$FL$500,22),\"\")","v":19},{"$f":"IFERROR(VLOOKUP($AB$6,'Entry Sheet'!B7:$FL$500,23),\"\")","v":16},{"$f":"IFERROR(VLOOKUP($AB$6,'Entry Sheet'!B7:$FL$500,24),\"\")","v":17},{"$f":"IFERROR(VLOOKUP($AB$6,'Entry Sheet'!B7:$FL$500,25),\"\")","v":18},{"$f":"IFERROR(VLOOKUP($AB$6,'Entry Sheet'!B7:$FL$500,26),\"\")","v":23},{"$f":"IFERROR(VLOOKUP($AB$6,'Entry Sheet'!B7:$FL$500,27),\"\")","v":0},null,{"$f":"IFERROR(VLOOKUP($AB$6,'Entry Sheet'!B7:$FL$500,28),\"\")","v":0},{"$f":"IFERROR(VLOOKUP($AB$6,'Entry Sheet'!B7:$FL$500,29),\"\")","v":0},{"$f":"IFERROR(VLOOKUP($AB$6,'Entry Sheet'!B7:$FL$500,30),\"\")","v":0},null,{"$f":"IFERROR(VLOOKUP($AB$6,'Entry Sheet'!B7:$FL$500,31),\"\")","v":0},{"$f":"IFERROR(VLOOKUP($AB$6,'Entry Sheet'!B7:$FL$500,32),\"\")","v":116},null,null,null,null,null,null,null,null,null,null,null,null,null,24]
[null,"ਹਾਜ਼ਰੀਆ",null,null,null,null,null,null,{"$f":"IFERROR(VLOOKUP($AB$6,'Entry Sheet'!B7:$FL$500,33),\"\")","v":0.92},{"$f":"IFERROR(VLOOKUP($AB$6,'Entry Sheet'!B7:$FL$500,34),\"\")","v":0.6333333333333333},{"$f":"IFERROR(VLOOKUP($AB$6,'Entry Sheet'!B7:$FL$500,35),\"\")","v":0.53333333333333333},{"$f":"IFERROR(VLOOKUP($AB$6,'Entry Sheet'!B7:$FL$500,36),\"\")","v":0.56666666666666665},{"$f":"IFERROR(VLOOKUP($AB$6,'Entry Sheet'!B7:$FL$500,37),\"\")","v":0.6},{"$f":"IFERROR(VLOOKUP($AB$6,'Entry Sheet'!B7:$FL$500,38),\"\")","v":0.76666666666666672},{"$f":"IFERROR(VLOOKUP($AB$6,'Entry Sheet'!B7:$FL$500,39),\"\")","v":0},null,{"$f":"IFERROR(VLOOKUP($AB$6,'Entry Sheet'!B7:$FL$500,40),\"\")","v":0},{"$f":"IFERROR(VLOOKUP($AB$6,'Entry Sheet'!B7:$FL$500,41),\"\")","v":0},{"$f":"IFERROR(VLOOKUP($AB$6,'Entry Sheet'!B7:$FL$500,42),\"\")","v":0},null,{"$f":"IFERROR(VLOOKUP($AB$6,'Entry Sheet'!B7:$FL$500,43),\"\")","v":0},{"$f":"IFERROR(VLOOKUP($AB$6,'Entry Sheet'!B7:$FL$500,44),\"\")","v":0.3569230769230769},null,null,null,null,null,null,null,null,null,null,null,null,null,25]
[null," ਜੇਕਰ ਕੁਲ ਹਾਜ਼ਰੀਆਂ 75% ਤੋਂ \nਘੱਟ ਹੈ ",null,null,null,null,null,null,null,null,null,null,null,null,null,null,null,null,null,null,null,null,null,null,null,null,null,null,null,null,null,null,null,null,null,26]
[null,null,null,null,null,null,null,null,null,null,null,null,null,null,null,null,null,null,null,null,null,null,null,null,null,null,null,null,null,null,null,null,null,null,null,27]
[null,null,null,null,null,null,null,null,null,null,null,null,null,null,null,null,null,null,null,null,null,null,null,null,null,null,null,null,null,null,null,null,null,null,null,28]
[null,null,null,null,null,null,null,null,null,null,null,null,null,null,null,null,null,null,null,null,null,null,null,null,null,null,null,null,null,null,null,null,null,null,null,29]
[null,null,null,null,null,null,null,null,null,null,null,null,null,null,null,null,null,null,null,null,null,null,null,null,null,null,null,null,null,null,null,null,null,null,null,30]
[null,"ਅੱਪਰ ਪ੍ਰਾਇਮਰੀ ਜਮਾਤਾਂ ਲਈ ਪ੍ਰਗਤੀ ਕਾਰਡ",null,null,null,null,null,null,null,null,null,null,null,null,null,null,null,null,null,null,null,null,null,null,null,null,null,null,null,null,null,null,null,null,null,31]
[null,"ਵਿਸ਼ਾ: ਪੰਜਾਬੀ",null,null,null,null,null,null,null,null,null,null,null,null,null,null,null,null,null,null,null,null,null,null,null,null,null,null,null,null,null,null,null,null,null,32]
[null,"ਥਿਉਰੀ ਪ੍ਰੀਖਿਆ",null,null,null,null,null,null,null,null,"CCE",null,null,null,null,null,null,null,null,null,null,null,null,null,null,null,null,null,null,null,null,null,null,null,null,33]
[null,null,null,null,null,"ਕੁਲ ਅੰਕ ",null,"ਪ੍ਰਾਪਤ ਅੰਕ",null,null,null,null,null,null,null,null,null,null,null,"ਕੁਲ ਅੰਕ ",null,"ਪ੍ਰਾਪਤ ਅੰਕ",null,null,null,null," ",null,null,null,null,null,null,null,null,34]
[null,"Bimonthly-I",null,null,null,20,null,{"$f":"IFERROR(VLOOKUP($AB$6,'Entry Sheet'!B7:$FL$500,46),\"\")","v":0},null,null,"ਪ੍ਰੈਕਟੀਕਲ ਪ੍ਰੋਜੈਕਟ /ਵਰਕਾ ਅਸਾਈਨਮੈਂਟ",null,null,null,null,null,null,null,null,6,null,{"$f":"IFERROR(VLOOKUP($AB$6,'Entry Sheet'!B7:$FL$500,51),\"\")","v":0},null,null,null,null,null,null,null,null,null,null,null,null,null,35]
[null,"ਟਰਮ ਪ੍ਰੀਖਿਆ -1",null,null,null,80,null,{"$f":"IFERROR(VLOOKUP($AB$6,'Entry Sheet'!B7:$FL$500,47),\"\")","v":0},null,null,"ਜਮਾਤ ਵਿੱਚ ਵਿਦਿਆਰਥੀ ਦੀ ਕਾਰਗੁਜ਼ਾਰੀ, ਸਹਿਯੋਗ ਅਤੇ ਅਨੁਸ਼ਾਸਨ",null,null,null,null,null,null,null,null,3,null,{"$f":"IFERROR(VLOOKUP($AB$6,'Entry Sheet'!B7:$FL$500,52),\"\")","v":0},null,null,null,null,null,null,null,null,null,null,null,null,null,36]
[null,"Bimonthly-II",null,null,null,20,null,{"$f":"IFERROR(VLOOKUP($AB$6,'Entry Sheet'!B7:$FL$500,48),\"\")","v":0},null,null,"ਪ੍ਰੀ-ਬੋਰਡ ਟਰਮ ਪ੍ਰੀਖਿਆ ਦੇ ਅੰਕ",null,null,null,null,null,null,null,null,3,null,{"$f":"IFERROR(VLOOKUP($AB$6,'Entry Sheet'!B7:$FL$500,53),\"\")","v":0},null,null,null,null,null,null,null,null,null,null,null,null,null,37]
[null,"ਟਰਮ ਪ੍ਰੀਖਿਆ-II /\nਪ੍ਰੀ ਬੋਰਡ ",null,null,null,80,null,{"$f":"IFERROR(VLOOKUP($AB$6,'Entry Sheet'!B7:$FL$500,49),\"\")","v":0},null,null,"ਬੋਲ ਲਿਖਤ, ਮੌਲਿਕ ਲਿਖਤ",null,null,null,null,null,null,null,null,7,null,{"$f":"IFERROR(VLOOKUP($AB$6,'Entry Sheet'!B7:$FL$500,54),\"\")","v":0},null,null,null,null,null,null,null,null,null,null,null,null,null,38]
[null,"ਸਲਾਨਾ ਪ੍ਰੀਖਿਆਵਾਂ",null,null,null,80,null,{"$f":"IFERROR(VLOOKUP($AB$6,'Entry Sheet'!B7:$FL$500,50),\"\")","v":0},null,null,"ਬੁੱਕ ਬੈਂਕ ",null,null,null,null,null,null,null,null,1,null,{"$f":"IFERROR(VLOOKUP($AB$6,'Entry Sheet'!B7:$FL$500,55),\"\")","v":0},null,null,null,null,null,null,null,null,null,null,null,null,null,39]
[null,null,null,null,null,null,null,null,null,null," ਕੁਲ",null,null,null,null,null,null,null,null,20,null,{"$f":"IFERROR(VLOOKUP($AB$6,'Entry Sheet'!B7:$FL$500,56),\"\")","v":0},null,null,null,null,null,null,null,null,null,null,null,null,null,40]
[null,"ਸਲਾਨਾ ਪ੍ਰੀਖਿਆਵਾਂ ਵਿੱਚ ਪ੍ਰਾਪਤ ਅੰਕ\n(80 ਵਿੱਚੋਂ)",null,null,null,null,null,"ਸੀ.ਸੀ.ਈ ਵਿੱਚ ਪ੍ਰਾਪਤ ਅੰਕ  \n(20 ਵਿੱਚੋਂ)",null,null,null,null,"ਕੁੱਲ ਪ੍ਰਾਪਤ ਅੰਕ (100 ਵਿੱਚੋਂ)\n",null,null,null,null,null,null,"ਗ੍ਰੇਡ",null,"ਵਿਸ਼ੇਸ਼ ਕਥਨ",null,null,null,null,null,null,null,null,null,null,null,null,null,41]
[null,{"$f":"H40","v":0},null,null,null,null,null,{"$f":"V41","v":0},null,null,null,null,{"$f":"IFERROR(VLOOKUP($AB$6,'Entry Sheet'!B7:$FL$500,57),\"\")","v":0},null,null,null,null,null,null,{"$f":"IFERROR(VLOOKUP($AB$6,'Entry Sheet'!B7:$FL$500,58),\"\")","v":"E"},null,null,null,null,null,null,null,null,null,null,null,null,null,null,null,42]
[null,"ਵਿਸ਼ਾ: ਹਿੰਦੀ",null,null,null,null,null,null,null,null,null,null,null,null,null,null,null,null,null,null,null,null,null,null,null,null,null,null,null,null,null,null,null,null,null,43]
[null,"ਥਿਉਰੀ ਪ੍ਰੀਖਿਆ",null,null,null,null,null,null,null,null,"CCE",null,null,null,null,null,null,null,null,null,null,null,null,null,null,null,null,null,null,null,null,null,null,null,null,44]
[null,null,null,null,null,"ਕੁਲ ਅੰਕ ",null,"ਪ੍ਰਾਪਤ ਅੰਕ",null,null,null,null,null,null,null,null,null,null,null,"ਕੁਲ ਅੰਕ ",null,"ਪ੍ਰਾਪਤ ਅੰਕ",null,null,null,null,null,null,null,null,null,null,null,null,null,45]
[null,"Bimonthly-I",null,null,null,20,null,{"$f":"IFERROR(VLOOKUP($AB$6,'Entry Sheet'!B7:$FL$500,59),\"\")","v":0},null,null,"ਪ੍ਰੈਕਟੀਕਲ ਪ੍ਰੋਜੈਕਟ /ਵਰਕਾ ਅਸਾਈਨਮੈਂਟ",null,null,null,null,null,null,null,null,6,null,{"$f":"IFERROR(VLOOKUP($AB$6,'Entry Sheet'!B7:$FL$500,64),\"\")","v":0},null,null,null,null,null,null,null,null,null,null,null,null,null,46]
[null,"ਟਰਮ ਪ੍ਰੀਖਿਆ -1",null,null,null,80,null,{"$f":"IFERROR(VLOOKUP($AB$6,'Entry Sheet'!B7:$FL$500,60),\"\")","v":0},null,null,"ਜਮਾਤ ਵਿੱਚ ਵਿਦਿਆਰਥੀ ਦੀ ਕਾਰਗੁਜ਼ਾਰੀ, ਸਹਿਯੋਗ ਅਤੇ ਅਨੁਸ਼ਾਸਨ",null,null,null,null,null,null,null,null,3,null,{"$f":"IFERROR(VLOOKUP($AB$6,'Entry Sheet'!B7:$FL$500,65),\"\")","v":0},null,null,null,null,null,null,null,null,null,null,null,null,null,47]
[null,"Bimonthly-II",null,null,null,20,null,{"$f":"IFERROR(VLOOKUP($AB$6,'Entry Sheet'!B7:$FL$500,61),\"\")","v":0},null,null,"ਪ੍ਰੀ-ਬੋਰਡ ਟਰਮ ਪ੍ਰੀਖਿਆ ਦੇ ਅੰਕ",null,null,null,null,null,null,null,null,3,null,{"$f":"IFERROR(VLOOKUP($AB$6,'Entry Sheet'!B7:$FL$500,66),\"\")","v":0},null,null,null,null,null,null,null,null,null,null,null,null,null,48]
[null,"ਟਰਮ ਪ੍ਰੀਖਿਆ-II /\nਪ੍ਰੀ ਬੋਰਡ ",null,null,null,80,null,{"$f":"IFERROR(VLOOKUP($AB$6,'Entry Sheet'!B7:$FL$500,62),\"\")","v":0},null,null,"ਭਾਸ਼ਾਈ ਕੌਸ਼ਲ ਦਾ ਮਲਾਂਕਣ",null,null,null,null,null,null,null,null,7,null,{"$f":"IFERROR(VLOOKUP($AB$6,'Entry Sheet'!B7:$FL$500,67),\"\")","v":0},null,null,null,null,null,null,null,null,null,null,null,null,null,49]
[null,"ਸਲਾਨਾ ਪ੍ਰੀਖਿਆਵਾਂ",null,null,null,80,null,{"$f":"IFERROR(VLOOKUP($AB$6,'Entry Sheet'!B7:$FL$500,63),\"\")","v":0},null,null,"ਬੁੱਕ ਬੈਂਕ ",null,null,null,null,null,null,null,null,1,null,{"$f":"IFERROR(VLOOKUP($AB$6,'Entry Sheet'!B7:$FL$500,68),\"\")","v":0},null,null,null,null,null,null,null,null,null,null,null,null,null,50]
[null,null,null,null,null,null,null,null,null,null,"ਕੁੱਲ",null,null,null,null,null,null,null,null,20,null,{"$f":"IFERROR(VLOOKUP($AB$6,'Entry Sheet'!B7:$FL$500,69),\"\")","v":0},null,null,null,null,null,null,null,null,null,null,null,null,null,51]
[null,"ਸਲਾਨਾ ਪ੍ਰੀਖਿਆਵਾਂ ਵਿੱਚ ਪ੍ਰਾਪਤ ਅੰਕ\n(80 ਵਿੱਚੋਂ)",null,null,null,null,null,"ਸੀ.ਸੀ.ਈ ਵਿੱਚ ਪ੍ਰਾਪਤ ਅੰਕ  \n(20 ਵਿੱਚੋਂ)",null,null,null,null,"ਕੁੱਲ ਪ੍ਰਾਪਤ ਅੰਕ (100 ਵਿੱਚੋਂ)\n",null,null,null,null,null,null,"ਗ੍ਰੇਡ",null,"ਵਿਸ਼ੇਸ਼ ਕਥਨ",null,null,null,null,null,null,null,null,null,null,null,null,null,52]
[null,{"$f":"H51","v":0},null,null,null,null,null,{"$f":"V52","v":0},null,null,null,null,{"$f":"IFERROR(VLOOKUP($AB$6,'Entry Sheet'!B7:$FL$500,70),\"\")","v":0},null,null,null,null,null,null,{"$f":"IFERROR(VLOOKUP($AB$6,'Entry Sheet'!B7:$FL$500,71),\"\")","v":"E"},null,null,null,null,null,null,null,null,null,null,null,null,null,null,null,53]
[null," ਵਿਸ਼ਾ: ਅੰਗਰੇਜ਼ੀ",null,null,null,null,null,null,null,null,null,null,null,null,null,null,null,null,null,null,null,null,null,null,null,null,null,null,null,null,null,null,null,null,null,54]
[null,"ਥਿਉਰੀ ਪ੍ਰੀਖਿਆ",null,null,null,null,null,null,null,null,"CCE",null,null,null,null,null,null,null,null,null,null,null,null,null,null,null,null,null,null,null,null,null,null,null,null,55]
[null,null,null,null,null,"ਕੁਲ ਅੰਕ ",null,"ਪ੍ਰਾਪਤ ਅੰਕ",null,null,null,null,null,null,null,null,null,null,null,"ਕੁਲ ਅੰਕ ",null,"ਪ੍ਰਾਪਤ ਅੰਕ",null,null,null,null,null,null,null,null,null,null,null,null,null,56]
[null,"Bimonthly-I",null,null,null,20,null,{"$f":"IFERROR(VLOOKUP($AB$6,'Entry Sheet'!B7:$FL$500,72),\"\")","v":0},null,null,"ਪ੍ਰੈਕਟੀਕਲ ਪ੍ਰੋਜੈਕਟ /ਵਰਕਾ ਅਸਾਈਨਮੈਂਟ",null,null,null,null,null,null,null,null,10,null,{"$f":"IFERROR(VLOOKUP($AB$6,'Entry Sheet'!B7:$FL$500,77),\"\")","v":0},null,null,null,null,null,null,null,null,null,null,null,null,null,57]
[null,"ਟਰਮ ਪ੍ਰੀਖਿਆ -1",null,null,null,80,null,{"$f":"IFERROR(VLOOKUP($AB$6,'Entry Sheet'!B7:$FL$500,73),\"\")","v":0},null,null,"ਜਮਾਤ ਵਿੱਚ ਵਿਦਿਆਰਥੀ ਦੀ ਕਾਰਗੁਜ਼ਾਰੀ, ਸਹਿਯੋਗ ਅਤੇ ਅਨੁਸ਼ਾਸਨ",null,null,null,null,null,null,null,null,2,null,{"$f":"IFERROR(VLOOKUP($AB$6,'Entry Sheet'!B7:$FL$500,78),\"\")","v":0},null,null,null,null,null,null,null,null,null,null,null,null,null,58]
[null,"Bimonthly-II",null,null,null,20,null,{"$f":"IFERROR(VLOOKUP($AB$6,'Entry Sheet'!B7:$FL$500,74),\"\")","v":0},null,null,"ਪ੍ਰੀ-ਬੋਰਡ ਟਰਮ ਪ੍ਰੀਖਿਆ ਦੇ ਅੰਕ",null,null,null,null,null,null,null,null,2,null,{"$f":"IFERROR(VLOOKUP($AB$6,'Entry Sheet'!B7:$FL$500,79),\"\")","v":0},null,null,null,null,null,null,null,null,null,null,null,null,null,59]
[null,"ਟਰਮ ਪ੍ਰੀਖਿਆ-II /\nਪ੍ਰੀ ਬੋਰਡ ",null,null,null,80,null,{"$f":"IFERROR(VLOOKUP($AB$6,'Entry Sheet'!B7:$FL$500,75),\"\")","v":0},null,null,"ਨੋਟ ਬੁੱਕ/ ਅਸਾਈਨਮੈਂਟ/ ਟੈਸਟ ਵਿੱਚ ਭਾਗੀਦਾਰੀ",null,null,null,null,null,null,null,null,6,null,{"$f":"IFERROR(VLOOKUP($AB$6,'Entry Sheet'!B7:$FL$500,80),\"\")","v":0},null,null,null,null,null,null,null,null,null,null,null,null,null,60]
[null,"ਸਲਾਨਾ ਪ੍ਰੀਖਿਆਵਾਂ",null,null,null,80,null,{"$f":"IFERROR(VLOOKUP($AB$6,'Entry Sheet'!B7:$FL$500,76),\"\")","v":0},null,null,"ਕੁੱਲ",null,null,null,null,null,null,null,null,20,null,{"$f":"IFERROR(VLOOKUP($AB$6,'Entry Sheet'!B7:$FL$500,81),\"\")","v":0},null,null,null,null,null,null,null,null,null,null,null,null,null,61]
[null,"ਸਲਾਨਾ ਪ੍ਰੀਖਿਆਵਾਂ ਵਿੱਚ ਪ੍ਰਾਪਤ ਅੰਕ\n(80 ਵਿੱਚੋਂ)",null,null,null,null,null,"ਸੀ.ਸੀ.ਈ ਵਿੱਚ ਪ੍ਰਾਪਤ ਅੰਕ  \n(20 ਵਿੱਚੋਂ)",null,null,null,null,"ਕੁੱਲ ਪ੍ਰਾਪਤ ਅੰਕ (100 ਵਿੱਚੋਂ)\n",null,null,null,null,null,null,"ਗ੍ਰੇਡ",null,"ਵਿਸ਼ੇਸ਼ ਕਥਨ",null,null,null,null,null,null,null,null,null,null,null,null,null,62]
[null,{"$f":"H62","v":0},null,null,null,null,null,{"$f":"V62","v":0},null,null,null,null,{"$f":"IFERROR(VLOOKUP($AB$6,'Entry Sheet'!B7:$FL$500,82),\"\")","v":0},null,null,null,null,null,null,{"$f":"IFERROR(VLOOKUP($AB$6,'Entry Sheet'!B7:$FL$500,83),\"\")","v":"E"},null,null,null,null,null,null,null,null,null,null,null,null,null,null,null,63]
[null,"ਵਿਸ਼ਾ :ਗਣਿਤ",null,null,null,null,null,null,null,null,null,null,null,null,null,null,null,null,null,null,null,null,null,null,null,null,null,null,null,null,null,null,null,null,null,64]
[null,"ਥਿਉਰੀ ਪ੍ਰੀਖਿਆ",null,null,null,null,null,null,null,null,"CCE",null,null,null,null,null,null,null,null,null,null,null,null,null,null,null,null,null,null,null,null,null,null,null,null,65]
[null,null,null,null,null,"ਕੁਲ ਅੰਕ ",null,"ਪ੍ਰਾਪਤ ਅੰਕ",null,null,null,null,null,null,null,null,null,null,null,"ਕੁਲ ਅੰਕ ",null,"ਪ੍ਰਾਪਤ ਅੰਕ",null,null,null,null,null,null,null,null,null,null,null,null,null,66]
[null,"Bimonthly-I",null,null,null,20,null,{"$f":"IFERROR(VLOOKUP($AB$6,'Entry Sheet'!B7:$FL$500,84),\"\")","v":0},null,null,"ਪ੍ਰੈਕਟੀਕਲ ਪ੍ਰੋਜੈਕਟ /ਵਰਕਾ ਅਸਾਈਨਮੈਂਟ",null,null,null,null,null,null,null,null,10,null,{"$f":"IFERROR(VLOOKUP($AB$6,'Entry Sheet'!B7:$FL$500,89),\"\")","v":0},null,null,null,null,null,null,null,null,null,null,null,null,null,67]
[null,"ਟਰਮ ਪ੍ਰੀਖਿਆ -1",null,null,null,80,null,{"$f":"IFERROR(VLOOKUP($AB$6,'Entry Sheet'!B7:$FL$500,85),\"\")","v":0},null,null,"ਜਮਾਤ ਵਿੱਚ ਵਿਦਿਆਰਥੀ ਦੀ ਕਾਰਗੁਜ਼ਾਰੀ, ਸਹਿਯੋਗ ਅਤੇ ਅਨੁਸ਼ਾਸਨ",null,null,null,null,null,null,null,null,2,null,{"$f":"IFERROR(VLOOKUP($AB$6,'Entry Sheet'!B7:$FL$500,90),\"\")","v":0},null,null,null,null,null,null,null,null,null,null,null,null,null,68]
[null,"Bimonthly-II",null,null,null,20,null,{"$f":"IFERROR(VLOOKUP($AB$6,'Entry Sheet'!B7:$FL$500,86),\"\")","v":0},null,null,"ਪ੍ਰੀ-ਬੋਰਡ ਟਰਮ ਪ੍ਰੀਖਿਆ ਦੇ ਅੰਕ",null,null,null,null,null,null,null,null,2,null,{"$f":"IFERROR(VLOOKUP($AB$6,'Entry Sheet'!B7:$FL$500,91),\"\")","v":0},null,null,null,null,null,null,null,null,null,null,null,null,null,69]
[null,"ਟਰਮ ਪ੍ਰੀਖਿਆ-II /\nਪ੍ਰੀ ਬੋਰਡ ",null,null,null,80,null,{"$f":"IFERROR(VLOOKUP($AB$6,'Entry Sheet'!B7:$FL$500,87),\"\")","v":0},null,null,"ਗਤੀਵਿਧੀਆਂ ਮੇਲੇ ਵਿੱਚ ਸੰਕਲਪ ਦੀ ਸਪਸ਼ਟਤਾ ਅਤੇ ਮਾਡਲ ਦੀ ਪੇਸ਼ਕਾਰੀ\n",null,null,null,null,null,null,null,null,2,null,{"$f":"IFERROR(VLOOKUP($AB$6,'Entry Sheet'!B7:$FL$500,92),\"\")","v":0},null,null,null,null,null,null,null,null,null,null,null,null,null,70]
[null,"ਸਲਾਨਾ ਪ੍ਰੀਖਿਆਵਾਂ",null,null,null,80,null,{"$f":"IFERROR(VLOOKUP($AB$6,'Entry Sheet'!B7:$FL$500,88),\"\")","v":0},null,null,"ਗਤੀਵਿਧੀ ਮੇਲੇ ਵਿੱਚ ਦਸਾਈ ਗਈ ਗਤੀਵਿਧੀ ਦਾ ਰੋਜਾਨਾ ਜੀਵਨ ਨਾਲ ਗਤੀਵਿਧੀ ਦਾ ਸਬੰਧ",null,null,null,null,null,null,null,null,2,null,{"$f":"IFERROR(VLOOKUP($AB$6,'Entry Sheet'!B7:$FL$500,93),\"\")","v":0},null,null,null,null,null,null,null,null,null,null,null,null,null,71]
[null,null,null,null,null,null,null,null,null,null,"ਕਾਪੀਆਂ ਦੀ ਸਾਂਭ ਸੰਭਾਲ ਸੁੰਦਰ ਲਿਖਾਈ ਅਤੇ ਪੁਸਤਕ ਬੈਂਕ ਵਿੱਚ ਪੁਰਾਣੀਆਂ ਪੁਸਤਕਾਂ ਨੂੰ ਜਮਾ ਕਰਾਉਣਾ\nBooks in book bank",null,null,null,null,null,null,null,null,2,null,{"$f":"IFERROR(VLOOKUP($AB$6,'Entry Sheet'!B7:$FL$500,94),\"\")","v":0},null,null,null,null,null,null,null,null,null,null,null,null,null,72]
[null,null,null,null,null,null,null,null,null,null,"ਕੁੱਲ",null,null,null,null,null,null,null,null,20,null,{"$f":"IFERROR(VLOOKUP($AB$6,'Entry Sheet'!B7:$FL$500,95),\"\")","v":0},null,null,null,null,null,null,null,null,null,null,null,null,null,73]
[null,"ਸਲਾਨਾ ਪ੍ਰੀਖਿਆਵਾਂ ਵਿੱਚ ਪ੍ਰਾਪਤ ਅੰਕ\n(80 ਵਿੱਚੋਂ)",null,null,null,null,null,"ਸੀ.ਸੀ.ਈ ਵਿੱਚ ਪ੍ਰਾਪਤ ਅੰਕ  \n(20 ਵਿੱਚੋਂ)",null,null,null,null,"ਕੁੱਲ ਪ੍ਰਾਪਤ ਅੰਕ (100 ਵਿੱਚੋਂ)\n",null,null,null,null,null,null,"ਗ੍ਰੇਡ",null,"ਵਿਸ਼ੇਸ਼ ਕਥਨ",null,null,null,null,null,null,null,null,null,null,null,null,null,74]
[null,{"$f":"H72","v":0},null,null,null,null,null,{"$f":"V74","v":0},null,null,null,null,{"$f":"IFERROR(VLOOKUP($AB$6,'Entry Sheet'!B7:$FL$500,96),\"\")","v":0},null,null,null,null,null,null,{"$f":"IFERROR(VLOOKUP($AB$6,'Entry Sheet'!B7:$FL$500,97),\"\")","v":"E"},null,null,null,null,null,null,null,null,null,null,null,null,null,null,null,75]
[null,null,null,null,null,null,null,null,null,null,null,null,null,null,null,null,null,null,null,null,null,null,null,null,null,null,null,null,null,null,null,null,null,null,null,76]
[null,null,null,null,null,null,null,null,null,null,null,null,null,null,null,null,null,null,null,null,null,null,null,null,null,null,null,null,null,null,null,null,null,null,null,77]
[null,"ਵਿਸ਼ਾ: ਸਾਇੰਸ",null,null,null,null,null,null,null,null,null,null,null,null,null,null,null,null,null,null,null,null,null,null,null,null,null,null,null,null,null,null,null,null,null,78]
[null,"ਥਿਉਰੀ ਪ੍ਰੀਖਿਆ",null,null,null,null,null,null,null,null,"CCE",null,null,null,null,null,null,null,null,null,null,null,null,null,null,null,null,null,null,null,null,null,null,null,null,79]
[null,null,null,null,null,"ਕੁਲ ਅੰਕ ",null,"ਪ੍ਰਾਪਤ ਅੰਕ",null,null,null,null,null,null,null,null,null,null,null,"ਕੁਲ ਅੰਕ ",null,"ਪ੍ਰਾਪਤ ਅੰਕ",null,null,null,null,null,null,null,null,null,null,null,null,null,80]
[null,"Bimonthly-I",null,null,null,20,null,{"$f":"IFERROR(VLOOKUP($AB$6,'Entry Sheet'!B7:$FL$500,98),\"\")","v":0},null,null,"ਪ੍ਰੈਕਟੀਕਲ ਪ੍ਰੋਜੈਕਟ /ਵਰਕਾ ਅਸਾਈਨਮੈਂਟ",null,null,null,null,null,null,null,null,10,null,{"$f":"IFERROR(VLOOKUP($AB$6,'Entry Sheet'!B7:$FL$500,103),\"\")","v":0},null,null,null,null,null,null,null,null,null,null,null,null,null,81]
[null,"ਟਰਮ ਪ੍ਰੀਖਿਆ -1",null,null,null,80,null,{"$f":"IFERROR(VLOOKUP($AB$6,'Entry Sheet'!B7:$FL$500,99),\"\")","v":0},null,null,"ਜਮਾਤ ਵਿੱਚ ਵਿਦਿਆਰਥੀ ਦੀ ਕਾਰਗੁਜ਼ਾਰੀ, ਸਹਿਯੋਗ ਅਤੇ ਅਨੁਸ਼ਾਸਨ",null,null,null,null,null,null,null,null,2,null,{"$f":"IFERROR(VLOOKUP($AB$6,'Entry Sheet'!B7:$FL$500,104),\"\")","v":0},null,null,null,null,null,null,null,null,null,null,null,null,null,82]
[null,"Bimonthly-II",null,null,null,20,null,{"$f":"IFERROR(VLOOKUP($AB$6,'Entry Sheet'!B7:$FL$500,100),\"\")","v":0},null,null,"ਪ੍ਰੀ-ਬੋਰਡ ਟਰਮ ਪ੍ਰੀਖਿਆ ਦੇ ਅੰਕ",null,null,null,null,null,null,null,null,2,null,{"$f":"IFERROR(VLOOKUP($AB$6,'Entry Sheet'!B7:$FL$500,105),\"\")","v":0},null,null,null,null,null,null,null,null,null,null,null,null,null,83]
[null,"ਟਰਮ ਪ੍ਰੀਖਿਆ-II /\nਪ੍ਰੀ ਬੋਰਡ ",null,null,null,80,null,{"$f":"IFERROR(VLOOKUP($AB$6,'Entry Sheet'!B7:$FL$500,101),\"\")","v":0},null,null,"ਗਤੀਵਿਧੀਆਂ ਮੇਲੇ ਵਿੱਚ ਸੰਕਲਪ ਦੀ ਸਪਸ਼ਟਤਾ ਅਤੇ ਮਾਡਲ ਦੀ ਪੇਸ਼ਕਾਰੀ\n",null,null,null,null,null,null,null,null,2,null,{"$f":"IFERROR(VLOOKUP($AB$6,'Entry Sheet'!B7:$FL$500,106),\"\")","v":0},null,null,null,null,null,null,null,null,null,null,null,null,null,84]
[null,"ਸਲਾਨਾ ਪ੍ਰੀਖਿਆਵਾਂ",null,null,null,80,null,{"$f":"IFERROR(VLOOKUP($AB$6,'Entry Sheet'!B7:$FL$500,102),\"\")","v":0},null,null,"ਗਤੀਵਿਧੀ ਮੇਲੇ ਵਿੱਚ ਦਸਾਈ ਗਈ ਗਤੀਵਿਧੀ ਦਾ ਰੋਜਾਨਾ ਜੀਵਨ ਨਾਲ ਗਤੀਵਿਧੀ ਦਾ ਸਬੰਧ",null,null,null,null,null,null,null,null,2,null,{"$f":"IFERROR(VLOOKUP($AB$6,'Entry Sheet'!B7:$FL$500,107),\"\")","v":0},null,null,null,null,null,null,null,null,null,null,null,null,null,85]
[null,null,null,null,null,null,null,null,null,null,"ਕਾਪੀਆਂ ਦੀ ਸਾਂਭ ਸੰਭਾਲ ਸੁੰਦਰ ਲਿਖਾਈ ਅਤੇ ਪੁਸਤਕ ਬੈਂਕ ਵਿੱਚ ਪੁਰਾਣੀਆਂ ਪੁਸਤਕਾਂ ਨੂੰ ਜਮਾ ਕਰਾਉਣਾ",null,null,null,null,null,null,null,null,2,null,{"$f":"IFERROR(VLOOKUP($AB$6,'Entry Sheet'!B7:$FL$500,108),\"\")","v":0},null,null,null,null,null,null,null,null,null,null,null,null,null,86]
[null,null,null,null,null,null,null,null,null,null,"ਕੁੱਲ",null,null,null,null,null,null,null,null,20,null,{"$f":"IFERROR(VLOOKUP($AB$6,'Entry Sheet'!B7:$FL$500,109),\"\")","v":0},null,null,null,null,null,null,null,null,null,null,null,null,null,87]
[null,"ਸਲਾਨਾ ਪ੍ਰੀਖਿਆਵਾਂ ਵਿੱਚ ਪ੍ਰਾਪਤ ਅੰਕ\n(80 ਵਿੱਚੋਂ)",null,null,null,null,null,"ਸੀ.ਸੀ.ਈ ਵਿੱਚ ਪ੍ਰਾਪਤ ਅੰਕ  \n(20 ਵਿੱਚੋਂ)",null,null,null,null,"ਕੁੱਲ ਪ੍ਰਾਪਤ ਅੰਕ (100 ਵਿੱਚੋਂ)\n",null,null,null,null,null,null,"ਗ੍ਰੇਡ",null,"ਵਿਸ਼ੇਸ਼ ਕਥਨ",null,null,null,null,null,null,null,null,null,null,null,null,null,88]
[null,{"$f":"H86","v":0},null,null,null,null,null,{"$f":"V88","v":0},null,null,null,null,{"$f":"IFERROR(VLOOKUP($AB$6,'Entry Sheet'!B7:$FL$500,110),\"\")","v":0},null,null,null,null,null,null,{"$f":"IFERROR(VLOOKUP($AB$6,'Entry Sheet'!B7:$FL$500,111),\"\")","v":"E"},null,null,null,null,null,null,null,null,null,null,null,null,null,null,null,89]
[null,"ਵਿਸ਼ਾ:ਸਮਾਜਿਕ ਵਿਗਿਆਨ",null,null,null,null,null,null,null,null,null,null,null,null,null,null,null,null,null,null,null,null,null,null,null,null,null,null,null,null,null,null,null,null,null,90]
[null,"ਥਿਉਰੀ ਪ੍ਰੀਖਿਆ",null,null,null,null,null,null,null,null,"CCE",null,null,null,null,null,null,null,null,null,null,null,null,null,null,null,null,null,null,null,null,null,null,null,null,91]
[null,null,null,null,null,"ਕੁਲ ਅੰਕ ",null,"ਪ੍ਰਾਪਤ ਅੰਕ",null,null,null,null,null,null,null,null,null,null,null,"ਕੁਲ ਅੰਕ ",null,"ਪ੍ਰਾਪਤ ਅੰਕ",null,null,null,null,null,null,null,null,null,null,null,null,null,92]
[null,"Bimonthly-I",null,null,null,20,null,{"$f":"IFERROR(VLOOKUP($AB$6,'Entry Sheet'!B7:$FL$500,112),\"\")","v":0},null,null,"ਟਰਮ ਪ੍ਰੀਖਿਆ/Bimonthly Tests",null,null,null,null,null,null,null,null,4,null,{"$f":"IFERROR(VLOOKUP($AB$6,'Entry Sheet'!B7:$FL$500,117),\"\")","v":0},null,null,null,null,null,null,null,null,null,null,null,null,null,93]
[null,"ਟਰਮ ਪ੍ਰੀਖਿਆ -1",null,null,null,80,null,{"$f":"IFERROR(VLOOKUP($AB$6,'Entry Sheet'!B7:$FL$500,113),\"\")","v":0},null,null,"ਪ੍ਰੀ-ਬੋਰਡ",null,null,null,null,null,null,null,null,5,null,{"$f":"IFERROR(VLOOKUP($AB$6,'Entry Sheet'!B7:$FL$500,118),\"\")","v":0},null,null,null,null,null,null,null,null,null,null,null,null,null,94]
[null,"Bimonthly-II",null,null,null,20,null,{"$f":"IFERROR(VLOOKUP($AB$6,'Entry Sheet'!B7:$FL$500,114),\"\")","v":0},null,null,"ਵਿਸ਼ੇ ਵਿੱਚ ਵਿਦਿਆਰਥੀ ਦੀ ਰੁਚੀ ਅਤੇ ਨੈਤਿਕ ਕਦਰਾਂ ਕੀਮਤਾਂ ਅਨੁਸਾਰ ਵਿਹਾਰ ਦਾ ਪ੍ਰਗਟਾਵਾ ਅਤੇ ਅਨੁਸ਼ਾਸਨ (ਹੋਮ_ਵਰਕ/ ਨੋਟ -ਬੁੱਕ /ਵਰਕ -)",null,null,null,null,null,null,null,null,4,null,{"$f":"IFERROR(VLOOKUP($AB$6,'Entry Sheet'!B7:$FL$500,119),\"\")","v":0},null,null,null,null,null,null,null,null,null,null,null,null,null,95]
[null,"ਟਰਮ ਪ੍ਰੀਖਿਆ-II /\nਪ੍ਰੀ ਬੋਰਡ ",null,null,null,80,null,{"$f":"IFERROR(VLOOKUP($AB$6,'Entry Sheet'!B7:$FL$500,115),\"\")","v":0},null,null,"ਬੁੱਕ ਬੈਂਕ ",null,null,null,null,null,null,null,null,1,null,{"$f":"IFERROR(VLOOKUP($AB$6,'Entry Sheet'!B7:$FL$500,120),\"\")","v":0},null,null,null,null,null,null,null,null,null,null,null,null,null,96]
[null,"ਸਲਾਨਾ ਪ੍ਰੀਖਿਆਵਾਂ",null,null,null,80,null,{"$f":"IFERROR(VLOOKUP($AB$6,'Entry Sheet'!B7:$FL$500,116),\"\")","v":0},null,null,"ਪ੍ਰੋਜੈਕਟ ਵਰਕ/ ਗਤੀਵਿਧੀ (ਕੁਦਰਤੀ ਆਫਤਾਂ ਰਾਸ਼ਟਰੀ ਅੰਦੋਲਨ 1885 ਤੋਂ 1919 ਈਸਵੀ ਤੱਕ/ ਮੌਲਿਕ ਅਧਿਕਾਰ ਦੇ ਕਰਤਵ /ਲਿੰਗ ਸਮਤਾ)",null,null,null,null,null,null,null,null,6,null,{"$f":"IFERROR(VLOOKUP($AB$6,'Entry Sheet'!B7:$FL$500,121),\"\")","v":0},null,null,null,null,null,null,null,null,null,null,null,null,null,97]
[null,null,null,null,null,null,null,null,null,null,"ਕੁੱਲ",null,null,null,null,null,null,null,null,20,null,{"$f":"IFERROR(VLOOKUP($AB$6,'Entry Sheet'!B7:$FL$500,122),\"\")","v":0},null,null,null,null,null,null,null,null,null,null,null,null,null,98]
[null,"ਸਲਾਨਾ ਪ੍ਰੀਖਿਆਵਾਂ ਵਿੱਚ ਪ੍ਰਾਪਤ ਅੰਕ\n(80 ਵਿੱਚੋਂ)",null,null,null,null,null,"ਸੀ.ਸੀ.ਈ ਵਿੱਚ ਪ੍ਰਾਪਤ ਅੰਕ  \n(20 ਵਿੱਚੋਂ)",null,null,null,null,"ਕੁੱਲ ਪ੍ਰਾਪਤ ਅੰਕ (100 ਵਿੱਚੋਂ)\n",null,null,null,null,null,null,"ਗ੍ਰੇਡ",null,"ਵਿਸ਼ੇਸ਼ ਕਥਨ",null,null,null,null,null,null,null,null,null,null,null,null,null,99]
[null,{"$f":"H98","v":0},null,null,null,null,null,{"$f":"V99","v":0},null,null,null,null,{"$f":"IFERROR(VLOOKUP($AB$6,'Entry Sheet'!B7:$FL$500,123),\"\")","v":0},null,null,null,null,null,null,{"$f":"IFERROR(VLOOKUP($AB$6,'Entry Sheet'!B7:$FL$500,124),\"\")","v":"E"},null,null,null,null,null,null,null,null,null,null,null,null,null,null,null,100]
[null,"ਵਿਸ਼ਾ : ਕੰਪਿਊਟਰ ਸਾਇੰਸ",null,null,null,null,null,null,null,null,null,null,null,null,null,null,null,null,null,null,null,null,null,null,null,null,null,null,null,null,null,null,null,null,null,101]
[null,"ਥਿਉਰੀ ਪ੍ਰੀਖਿਆ",null,null,null,null,null,null,null,null,"CCE  and Practical",null,null,null,null,null,null,null,null,null,null,null,null,null,null,null,null,null,null,null,null,null,null,null,null,102]
[null,null,null,null,null,"ਕੁਲ ਅੰਕ ",null,"ਪ੍ਰਾਪਤ ਅੰਕ",null,null,null,null,null,null,null,null,null,null,null,"ਕੁਲ ਅੰਕ ",null,"ਪ੍ਰਾਪਤ ਅੰਕ",null,null,null,null,null,null,null,null,null,null,null,null,null,103]
[null,"Bimonthly-I",null,null,null,20,null,{"$f":"IFERROR(VLOOKUP($AB$6,'Entry Sheet'!B7:$FL$500,125),\"\")","v":0},null,null,"ਜਮਾਤ ਵਿੱਚ ਵਿਦਿਆਰਥੀ ਦੀ ਕਾਰਗੁਜ਼ਾਰੀ, ਸਹਿਯੋਗ ਅਤੇ ਅਨੁਸ਼ਾਸਨ",null,null,null,null,null,null,null,null,8,null,{"$f":"IFERROR(VLOOKUP($AB$6,'Entry Sheet'!B7:$FL$500,130),\"\")","v":0},null,null,null,null,null,null,null,null,null,null,null,null,null,104]
[null,"ਟਰਮ ਪ੍ਰੀਖਿਆ -1",null,null,null,40,null,{"$f":"IFERROR(VLOOKUP($AB$6,'Entry Sheet'!B7:$FL$500,126),\"\")","v":0},null,null,"ਪ੍ਰੀ-ਬੋਰਡ ਟਰਮ ਪ੍ਰੀਖਿਆ ਦੇ ਅੰਕ",null,null,null,null,null,null,null,null,8,null,{"$f":"IFERROR(VLOOKUP($AB$6,'Entry Sheet'!B7:$FL$500,131),\"\")","v":0},null,null,null,null,null,null,null,null,null,null,null,null,null,105]
[null,"Bimonthly-II",null,null,null,20,null,{"$f":"IFERROR(VLOOKUP($AB$6,'Entry Sheet'!B7:$FL$500,127),\"\")","v":0},null,null,"ਕਾਪੀਆਂ ਦੀ ਸਾਂਭ ਸੰਭਾਲ ਸੁੰਦਰ ਲਿਖਾਈ ਅਤੇ ਪੁਸਤਕ ਬੈਂਕ ਵਿੱਚ ਪੁਰਾਣੀਆਂ ਪੁਸਤਕਾਂ ਨੂੰ ਜਮਾ ਕਰਾਉਣਾ",null,null,null,null,null,null,null,null,4,null,{"$f":"IFERROR(VLOOKUP($AB$6,'Entry Sheet'!B7:$FL$500,132),\"\")","v":0},null,null,null,null,null,null,null,null,null,null,null,null,null,106]
[null,"ਟਰਮ ਪ੍ਰੀਖਿਆ-II /\nਪ੍ਰੀ ਬੋਰਡ ",null,null,null,40,null,{"$f":"IFERROR(VLOOKUP($AB$6,'Entry Sheet'!B7:$FL$500,128),\"\")","v":0},null,null,"ਕੁੱਲ",null,null,null,null,null,null,null,null,20,null,{"$f":"IFERROR(VLOOKUP($AB$6,'Entry Sheet'!B7:$FL$500,133),\"\")","v":0},null,null,null,null,null,null,null,null,null,null,null,null,null,107]
[null,"ਸਲਾਨਾ ਪ੍ਰੀਖਿਆਵਾਂ",null,null,null,40,null,{"$f":"IFERROR(VLOOKUP($AB$6,'Entry Sheet'!B7:$FL$500,129),\"\")","v":0},null,null,null,null,null,null,null,null,null,null,null,null,null,null,null,null,null,null,null,null,null,null,null,null,null,null,null,108]
[null,"ਕੁੱਲ ਅੰਕ",null,null,null,"ਥਿਓਰੀ ਵਿੱਚ ਅੰਕ (40 ਵਿੱਚੋਂ)",null,"ਸੀ.ਸੀ.ਈ ਵਿੱਚ ਪ੍ਰਾਪਤ ਅੰਕ  (20 ਵਿੱਚੋਂ)",null,null,"ਪ੍ਰੈਕਟੀਕਲ ਅੰਕ \n (40 ਵਿੱਚੋਂ)\n",null,null,null,"ਕੁੱਲ ਪ੍ਰਾਪਤ ਅੰਕ (100 ਵਿੱਚੋਂ)\n",null,null,null,null,"ਗ੍ਰੇਡ",null,"ਵਿਸ਼ੇਸ਼ ਕਥਨ",null,null,null,null,null,null,null,null,null,null,null,null,null,109]
[null,100,null,null,null,{"$f":"H109","v":0},null,{"$f":"V108","v":0},null,null,{"$f":"IFERROR(VLOOKUP($AB$6,'Entry Sheet'!B7:$FL$500,134),\"\")","v":0},null,null,null,{"$f":"IFERROR(VLOOKUP($AB$6,'Entry Sheet'!B7:$FL$500,135),\"\")","v":0},null,null,null,null,{"$f":"IFERROR(VLOOKUP($AB$6,'Entry Sheet'!B7:$FL$500,136),\"\")","v":"E"},null,null,null,null,null,null,null,null,null,null,null,null,null,null,null,110]
[null,"ਵਿਸ਼ਾ: ਸਰੀਰਕ ਸਿੱਖਿਆ",null,null,null,null,null,null,null,null,null,null,null,null,null,null,null,null,null,null,null,null,null,null,null,null,null,null,null,null,null,null,null,null,null,111]
[null,"ਥਿਉਰੀ ਪ੍ਰੀਖਿਆ",null,null,null,null,null,null,null,null,"ਸੀ.ਸੀ.ਈ ਅਤੇ ਪ੍ਰੈਕਟੀਕਲ ",null,null,null,null,null,null,null,null,null,null,null,null,null,null,null,null,null,null,null,null,null,null,null,null,112]
[null,null,null,null,null,"ਕੁਲ ਅੰਕ ",null,"ਪ੍ਰਾਪਤ ਅੰਕ",null,null,null,null,null,null,null,null,null,null,null,"ਕੁਲ ਅੰਕ ",null,"ਪ੍ਰਾਪਤ ਅੰਕ",null,null,null,null,null,null,null,null,null,null,null,null,null,113]
[null,"Bimonthly-I",null,null,null,20,null,{"$f":"IFERROR(VLOOKUP($AB$6,'Entry Sheet'!B7:$FL$500,137),\"\")","v":0},null,null,"ਪ੍ਰੈਕਟੀਕਲ/ ਪ੍ਰੋਜੈਕਟ ਵਰਕ/ ਅਸਾਈਨਮੈਂਟ",null,null,null,null,null,null,null,null,3,null,{"$f":"IFERROR(VLOOKUP($AB$6,'Entry Sheet'!B7:$FL$500,142),\"\")","v":0},null,null,null,null,null,null,null,null,null,null,null,null,null,114]
[null,"ਟਰਮ ਪ੍ਰੀਖਿਆ -1",null,null,null,40,null,{"$f":"IFERROR(VLOOKUP($AB$6,'Entry Sheet'!B7:$FL$500,138),\"\")","v":0},null,null,"ਜਮਾਤ ਵਿੱਚ ਵਿਦਿਆਰਥੀ ਦੀ ਕਾਰਗੁਜ਼ਾਰੀ, ਸਹਿਯੋਗ ਅਤੇ ਅਨੁਸ਼ਾਸਨ",null,null,null,null,null,null,null,null,2,null,{"$f":"IFERROR(VLOOKUP($AB$6,'Entry Sheet'!B7:$FL$500,143),\"\")","v":0},null,null,null,null,null,null,null,null,null,null,null,null,null,115]
[null,"Bimonthly-II",null,null,null,20,null,{"$f":"IFERROR(VLOOKUP($AB$6,'Entry Sheet'!B7:$FL$500,139),\"\")","v":0},null,null,"ਪ੍ਰੀ-ਬੋਰਡ ਟਰਮ ਪ੍ਰੀਖਿਆ ਦੇ ਅੰਕ",null,null,null,null,null,null,null,null,4,null,{"$f":"IFERROR(VLOOKUP($AB$6,'Entry Sheet'!B7:$FL$500,144),\"\")","v":0},null,null,null,null,null,null,null,null,null,null,null,null,null,116]
[null,"ਟਰਮ ਪ੍ਰੀਖਿਆ-II /\nਪ੍ਰੀ ਬੋਰਡ ",null,null,null,40,null,{"$f":"IFERROR(VLOOKUP($AB$6,'Entry Sheet'!B7:$FL$500,140),\"\")","v":0},null,null,"ਕਾਪੀਆਂ ਦੀ ਸਾਂਭ ਸੰਭਾਲ ਸੁੰਦਰ ਲਿਖਾਈ ਅਤੇ ਪੁਸਤਕ ਬੈਂਕ ਵਿੱਚ \nਪੁਰਾਣੀਆਂ ਪੁਸਤਕਾਂ ਨੂੰ ਜਮਾ ਕਰਾਉਣਾ",null,null,null,null,null,null,null,null,1,null,{"$f":"IFERROR(VLOOKUP($AB$6,'Entry Sheet'!B7:$FL$500,145),\"\")","v":0},null,null,null,null,null,null,null,null,null,null,null,null,null,117]
[null,"ਸਲਾਨਾ ਪ੍ਰੀਖਿਆਵਾਂ",null,null,null,40,null,{"$f":"IFERROR(VLOOKUP($AB$6,'Entry Sheet'!B7:$FL$500,141),\"\")","v":0},null,null,"ਕੁੱਲ",null,null,null,null,null,null,null,null,10,null,{"$f":"IFERROR(VLOOKUP($AB$6,'Entry Sheet'!B7:$FL$500,146),\"\")","v":0},null,null,null,null,null,null,null,null,null,null,null,null,null,118]
[null,"ਸਲਾਨਾ ਪ੍ਰੀਖਿਆਵਾਂ ਵਿੱਚ ਪ੍ਰਾਪਤ ਅੰਕ\n(40 ਵਿੱਚੋਂ)",null,null,null,null,null,"ਸੀ.ਸੀ.ਈ \n(20 ਵਿੱਚੋਂ)",null,null,"ਪ੍ਰੈਕਟੀਕਲ ਅੰਕ \n (40 ਵਿੱਚੋਂ)",null,null,null,"ਕੁੱਲ ਪ੍ਰਾਪਤ ਅੰਕ (100 ਵਿੱਚੋਂ)\n",null,null,null,null,"ਗ੍ਰੇਡ",null,"ਵਿਸ਼ੇਸ਼ ਕਥਨ",null,null,null,null,null,null,null,null,null,null,null,null,null,119]
[null,{"$f":"H119","v":0},null,null,null,null,null,{"$f":"V119","v":0},null,null,{"$f":"IFERROR(VLOOKUP($AB$6,'Entry Sheet'!B7:$FL$500,147),\"\")","v":0},null,null,null,{"$f":"IFERROR(VLOOKUP($AB$6,'Entry Sheet'!B7:$FL$500,148),\"\")","v":0},null,null,null,null,{"$f":"IFERROR(VLOOKUP($AB$6,'Entry Sheet'!B7:$FL$500,149),\"\")","v":"E"},null,null,null,null,null,null,null,null,null,null,null,null,null,null,null,120]
[null,"ਵਿਸ਼ਾ:ਡਰਾਇੰਗ",null,null,null,null,null,null,null,null,null,null,null,null,null,null,null,null,null,null,null,null,null,null,null,null,null,null,null,null,null,null,null,null,null,121]
[null,"ਥਿਉਰੀ ਪ੍ਰੀਖਿਆ",null,null,null,null,null,null,null,null,"ਸੀ.ਸੀ.ਈ ਅਤੇ ਪ੍ਰੈਕਟੀਕਲ ",null,null,null,null,null,null,null,null,null,null,null,null,null,null,null,null,null,null,null,null,null,null,null,null,122]
[null,null,null,null,null,"ਕੁਲ ਅੰਕ ",null,"ਪ੍ਰਾਪਤ ਅੰਕ",null,null,null,null,null,null,null,null,null,null,null,"ਕੁਲ ਅੰਕ ",null,"ਪ੍ਰਾਪਤ ਅੰਕ",null,null,null,null,null,null,null,null,null,null,null,null,null,123]
[null,"Bimonthly-I",null,null,null,{"$f":"'Entry Sheet'!EU5","v":20},null,{"$f":"IFERROR(VLOOKUP($AB$6,'Entry Sheet'!B7:$FL$500,150),\"\")","v":0},null,null,"ਪ੍ਰੈਕਟੀਕਲ/ ਪ੍ਰੋਜੈਕਟ ਵਰਕ/ ਅਸਾਈਨਮੈਂਟ",null,null,null,null,null,null,null,null,{"$f":"'Entry Sheet'!EZ5","v":10},null,{"$f":"IFERROR(VLOOKUP($AB$6,'Entry Sheet'!B7:$FL$500,155),\"\")","v":0},null,null,null,null,null,null,null,null,null,null,null,null,null,124]
[null,"ਟਰਮ ਪ੍ਰੀਖਿਆ -1",null,null,null,{"$f":"'Entry Sheet'!EV5","v":80},null,{"$f":"IFERROR(VLOOKUP($AB$6,'Entry Sheet'!B7:$FL$500,151),\"\")","v":0},null,null,"ਜਮਾਤ ਵਿੱਚ ਵਿਦਿਆਰਥੀ ਦੀ ਕਾਰਗੁਜ਼ਾਰੀ, ਸਹਿਯੋਗ ਅਤੇ ਅਨੁਸ਼ਾਸਨ",null,null,null,null,null,null,null,null,{"$f":"'Entry Sheet'!FA5","v":5},null,{"$f":"IFERROR(VLOOKUP($AB$6,'Entry Sheet'!B7:$FL$500,156),\"\")","v":0},null,null,null,null,null,null,null,null,null,null,null,null,null,125]
[null,"Bimonthly-II",null,null,null,{"$f":"'Entry Sheet'!EW5","v":20},null,{"$f":"IFERROR(VLOOKUP($AB$6,'Entry Sheet'!B7:$FL$500,152),\"\")","v":0},null,null,"ਪ੍ਰੀ-ਬੋਰਡ ਟਰਮ ਪ੍ਰੀਖਿਆ ਦੇ ਅੰਕ",null,null,null,null,null,null,null,null,{"$f":"'Entry Sheet'!FB5","v":4},null,{"$f":"IFERROR(VLOOKUP($AB$6,'Entry Sheet'!B7:$FL$500,157),\"\")","v":0},null,null,null,null,null,null,null,null,null,null,null,null,null,126]
[null,"ਟਰਮ ਪ੍ਰੀਖਿਆ-II /\nਪ੍ਰੀ ਬੋਰਡ ",null,null,null,{"$f":"'Entry Sheet'!EX5","v":80},null,{"$f":"IFERROR(VLOOKUP($AB$6,'Entry Sheet'!B7:$FL$500,153),\"\")","v":0},null,null,"ਕਾਪੀਆਂ ਦੀ ਸਾਂਭ ਸੰਭਾਲ ਸੁੰਦਰ ਲਿਖਾਈ ਅਤੇ ਪੁਸਤਕ ਬੈਂਕ ਵਿੱਚ \nਪੁਰਾਣੀਆਂ ਪੁਸਤਕਾਂ ਨੂੰ ਜਮਾ ਕਰਾਉਣਾ",null,null,null,null,null,null,null,null,{"$f":"'Entry Sheet'!FC5","v":1},null,{"$f":"IFERROR(VLOOKUP($AB$6,'Entry Sheet'!B7:$FL$500,158),\"\")","v":0},null,null,null,null,null,null,null,null,null,null,null,null,null,127]
[null,"ਸਲਾਨਾ ਪ੍ਰੀਖਿਆਵਾਂ",null,null,null,{"$f":"'Entry Sheet'!EY5","v":80},null,{"$f":"IFERROR(VLOOKUP($AB$6,'Entry Sheet'!B7:$FL$500,154),\"\")","v":0},null,null,"ਕੁੱਲ",null,null,null,null,null,null,null,null,{"$f":"SUM(T125:U128)","v":20},null,{"$f":"IFERROR(VLOOKUP($AB$6,'Entry Sheet'!B7:$FL$500,159),\"\")","v":0},null,null,null,null,null,null,null,null,null,null,null,null,null,128]
[null,"ਥਿਉਰੀ ਵਿੱਚ ਪ੍ਰਾਪਤ ਅੰਕ",null,null,null,null,null,"ਸੀ.ਸੀ.ਈ ਵਿੱਚ ਪ੍ਰਾਪਤ ਅੰਕ  (20 ਵਿੱਚੋਂ)",null,null,"ਪ੍ਰੈਕਟੀਕਲ ਅੰਕ ",null,null,null,"ਕੁੱਲ ਪ੍ਰਾਪਤ ਅੰਕ \n",null,null,null,null,"ਗ੍ਰੇਡ",null,"ਵਿਸ਼ੇਸ਼ ਕਥਨ",null,null,null,null,null,null,null,null,null,null,null,null,null,129]
[null,{"$f":"H129","v":0},null,null,null,null,null,{"$f":"V129","v":0},null,null,{"$f":"IFERROR(VLOOKUP($AB$6,'Entry Sheet'!B7:$FL$500,160),\"\")","v":0},null,null,null,{"$f":"IFERROR(VLOOKUP($AB$6,'Entry Sheet'!B7:$FL$500,161),\"\")","v":0},null,null,null,null,{"$f":"IFERROR(VLOOKUP($AB$6,'Entry Sheet'!B7:$FL$500,162),\"\")","v":"E"},null,null,null,null,null,null,null,null,null,null,null,null,null,null,null,130]
[null,"Grand Total",null,null,null,null,null,null,null,null,null,null,null,null,null,null,null,null,null,null,null,null,null,null,null,null,null,null,null,null,null,null,null,null,null,131]
[null,"ਕੁੱਲ  ਅੰਕ",null,null,null,null,null,"ਪ੍ਰਾਪਤ ਅੰਕ",null,null,null,null,"ਪ੍ਰਤੀਸ਼ਤ /ਗ੍ਰੇਡ",null,null,null,null,"ਨਤੀਜਾ",null,null,null,null,null,null,null,null,null,null,null,null,null,null,null,null,null,132]
[null,600,null,null,null,null,null,{"$f":"IFERROR(VLOOKUP($AB$6,'Entry Sheet'!B7:$FL$500,163),\"\")","v":"---"},null,null,null,null,{"$f":"IFERROR(VLOOKUP($AB$6,'Entry Sheet'!B7:$FL$500,165),\"\")","v":""},null,null,null,null,{"$f":"IFERROR(VLOOKUP($AB$6,'Entry Sheet'!B7:$FL$500,166),\"\")","v":"----"},null,null,null,null,null,null,null,null,null,null,null,null,null,null,null,null,null,133]
[null,"3600  Progress Report (ਪ੍ਰਗਤੀ ਰਿਪੋਰਟ)",null,null,null,null,null,null,null,null,null,null,null,null,null,null,null,null,null,null,null,null,null,null,null,null,null,null,null,null,null,null,null,null,null,134]
[null,"ਸੰਕੇਤਕ/ ਸੂਚਕ",null,null,null,null,null,null,null,null,null,null,null,null,null,null,null,"ਆਰੰਭਕ \nBeginner",null,"ਸਮਰੱਥ\nProficient",null," ਕੁਸ਼ਲ\nAdvanced",null,null,null,null,null,null,null,null,null,null,null,null,null,135]
[null,"ਜਾਗਰੂਕਤਾ ( Awareness )",null,null,null,null,null,null,null,null,null,null,null,null,null,null,null,null,null,null,null,null,null,null,null,null,null,null,null,null,null,null,null,null,null,136]
[null,"ਗੱਲਬਾਤ  (Communication)",null,null,null,null,null,null,null,null,null,null,null,null,null,null,null,null,null,null,null,null,null,null,null,null,null,null,null,null,null,null,null,null,null,137]
[null,"ਵਿਦਿਆਰਥੀ ਦੂਜਿਆਂ ਨਾਲ਼ ਰਸਮੀ ਅਤੇ ਗ਼ੈਰ ਰਸਮੀ ਗੱਲ-ਬਾਤ ਕਰ ਸਕਦਾ ਹੈ।",null,null,null,null,null,null,null,null,null,null,null,null,null,null,null,{"$f":"IF(OR($M$134=\"D\",$M$134=\"C+\",$M$134=\"C\"),\"P\",\"\")","v":""},null,{"$f":"IF(OR($M$134=\"A\",$M$134=\"B+\"),\"P\",\"\")","v":""},null,{"$f":"IF($M$134=\"A+\",\"P\",\"\")","v":""},null,null,null,null,null,null,null,null,null,null,null,null,null,138]
[null,"ਗੱਲ-ਬਾਤ ਕਰਦੇ ਸਮੇਂ ਵਿਦਿਆਰਥੀ ਦੁਸਰੇ ਪ੍ਰਤੀ ਸਤਿਕਾਰ ਅਤੇ ਹਮਦਰਦੀ ਦਾ ਪ੍ਰਦਰਸ਼ਨ ਕਰਦਾ ਹੈ।",null,null,null,null,null,null,null,null,null,null,null,null,null,null,null,{"$f":"IF(OR($M$134=\"D\",$M$134=\"C+\",$M$134=\"C\"),\"P\",\"\")","v":""},null,{"$f":"IF(OR($M$134=\"A\",$M$134=\"B+\"),\"P\",\"\")","v":""},null,{"$f":"IF($M$134=\"A+\",\"P\",\"\")","v":""},null,null,null,null,null,null,null,null,null,null,null,null,null,139]
[null,"ਵਿਦਿਆਰਥੀ ਇਸ ਨਾਲ਼ ਜਾਣੂ ਹੈ ਕਿ ਕਿਵੇਂ ਸੱਭਿਆਚਾਰ ਅਤੇ ਸੰਦਰਭ (context) ਗੱਲਬਾਤ 'ਤੇ ਪ੍ਰਭਾਵ ਪਾਉਂਦਾ ਹੈ।\n",null,null,null,null,null,null,null,null,null,null,null,null,null,null,null,"",null,"",null,"",null,null,null,null,null,null,null,null,null,null,null,null,null,140]
[null,"ਵਿਦਿਆਰਥੀ ਮੌਖਿਕ ਅਤੇ ਲਿਖਿਤ ਰੂਪ ਵਿੱਚ ਜਾਂ ਗੈਰ-ਮੌਖਿਕ ਰੂਪ ਵਿੱਚ ਆਪਣੇ ਵਿਚਾਰ ਪ੍ਰਗਟ ਕਰਦਾ ਹੈ।",null,null,null,null,null,null,null,null,null,null,null,null,null,null,null,"",null,"",null,"",null,null,null,null,null,null,null,null,null,null,null,null,null,141]
[null,"ਵਿਅਕਤੀਗਤ ਵਿਕਾਸ ਅਤੇ ਤੰਦਰੁਸਤੀ(Growth and Well -being)",null,null,null,null,null,null,null,null,null,null,null,null,null,null,null,null,null,null,null,null,null,null,null,null,null,null,null,null,null,null,null,null,null,142]
[null,"ਵਿਦਿਆਰਥੀ ਸਰੀਰਿਕ ਤੰਦਰੁਸਤੀ ਲਈ ਆਪਣੇ ਉਦੇਸ਼ ਮਿੱਥ ਕੇ ਉਸ ਦੀ ਪ੍ਰਾਪਤੀ ਲਈ ਯਤਨ ਕਰਦਾ ਹੈ।",null,null,null,null,null,null,null,null,null,null,null,null,null,null,null,{"$f":"IF(OR($M$134=\"D\",$M$134=\"C+\",$M$134=\"C\"),\"P\",\"\")","v":""},null,{"$f":"IF(OR($M$134=\"A\",$M$134=\"B+\"),\"P\",\"\")","v":""},null,{"$f":"IF($M$134=\"A+\",\"P\",\"\")","v":""},null,null,null,null,null,null,null,null,null,null,null,null,null,143]
[null,"ਵਿਦਿਆਰਥੀ ਆਪਣੀ ਅਤੇ ਆਪਣੇ ਆਲ਼ੇ-ਦੁਆਲ਼ੇ ਦੀ ਸਫ਼ਾਈ ਲਈ ਬਹੁਤ ਸੁਚੇਤ ਹੈ।",null,null,null,null,null,null,null,null,null,null,null,null,null,null,null,{"$f":"IF(OR($M$134=\"D\",$M$134=\"C+\",$M$134=\"C\"),\"P\",\"\")","v":""},null,{"$f":"IF(OR($M$134=\"A\",$M$134=\"B+\"),\"P\",\"\")","v":""},null,{"$f":"IF($M$134=\"A+\",\"P\",\"\")","v":""},null,null,null,null,null,null,null,null,null,null,null,null,null,144]
[null,"ਵਿਦਿਆਰਥੀ ਲੋਕ ਭਲਾਈ ਪ੍ਰਤੀ ਆਪਣੀ ਸਮਾਜਿਕ ਜਿੰਮੇਵਾਰੀ ਦੀ ਪਾਲਣਾ ਕਰਦਾ ਹੈ।",null,null,null,null,null,null,null,null,null,null,null,null,null,null,null,"",null,"",null,"",null,null,null,null,null,null,null,null,null,null,null,null,null,145]
[null,"Sensitivity (ਸੰਵੇਦਨਸ਼ੀਲਤਾ)",null,null,null,null,null,null,null,null,null,null,null,null,null,null,null,null,null,null,null,null,null,null,null,null,null,null,null,null,null,null,null,null,null,146]
[null,"ਆਪਸੀ ਸਹਿਯੋਗ(Collaboration)",null,null,null,null,null,null,null,null,null,null,null,null,null,null,null,null,null,null,null,null,null,null,null,null,null,null,null,null,null,null,null,null,null,147]
[null,"ਦੂਜਿਆਂ ਨਾਲ਼ ਸਹਿਯੋਗ ਰਾਹੀਂ ਇੱਕ ਸਾਂਝੇ ਟੀਚੇ ਨੂੰ ਪ੍ਰਾਪਤ ਕਰਨ ਲਈ ਕੰਮ ਕਰਦਾ ਹੈ।",null,null,null,null,null,null,null,null,null,null,null,null,null,null,null,{"$f":"IF(OR($M$134=\"D\",$M$134=\"C+\",$M$134=\"C\"),\"P\",\"\")","v":""},null,{"$f":"IF(OR($M$134=\"A\",$M$134=\"B+\"),\"P\",\"\")","v":""},null,{"$f":"IF($M$134=\"A+\",\"P\",\"\")","v":""},null,null,null,null,null,null,null,null,null,null,null,null,null,148]
[null,"ਵਿਦਿਆਰਥੀ ਦੂਜਿਆਂ ਨਾਲ਼ ਵਿਚਾਰਾਂ ਦਾ ਅਦਾਨ-ਪ੍ਰਦਾਨ ਕਰਦਾ ਹੈ।",null,null,null,null,null,null,null,null,null,null,null,null,null,null,null,"",null,"",null,"",null,null,null,null,null,null,null,null,null,null,null,null,null,149]
[null,"ਆਪਣੇ ਸਹਿਪਾਠੀਆਂ ਅਤੇ ਦੋਸਤਾਂ ਨਾਲ ਵਧੀਆ ਸੰਬੰਧ ਬਣਾ ਕੇ ਰੱਖਦਾ ਹੈ।",null,null,null,null,null,null,null,null,null,null,null,null,null,null,null,"",null,"",null,"",null,null,null,null,null,null,null,null,null,null,null,null,null,150]
[null,"Cultural & Global Citizenship",null,null,null,null,null,null,null,null,null,null,null,null,null,null,null,null,null,null,null,null,null,null,null,null,null,null,null,null,null,null,null,null,null,151]
[null,"ਵਿਦਿਆਰਥੀ ਸੱਭਿਆਚਾਰਕ, ਸਮਾਜਿਕ, ਆਰਥਿਕ ਪ੍ਰਣਾਲੀ ਅਤੇ ਵਾਤਾਵਰਨ ਨਾਲ਼ ਜੁੜੀਆਂ ਗਤੀਵਿਧੀਆਂ ਵਿੱਚ ਵੱਧ ਚੜ੍ਹ ਕੇ ਭਾਗ ਲੈਂਦਾ ਹੈ।",null,null,null,null,null,null,null,null,null,null,null,null,null,null,null,"",null,"",null,"",null,null,null,null,null,null,null,null,null,null,null,null,null,152]
[null,"ਵਿਦਿਆਰਥੀ ਹਮੇਸ਼ਾ ਦੂਜਿਆਂ ਦੀ ਭਲਾਈ ਲਈ ਯਤਨਸ਼ੀਲ ਰਹਿੰਦਾ ਹੈ।\n",null,null,null,null,null,null,null,null,null,null,null,null,null,null,null,"",null,"",null,"",null,null,null,null,null,null,null,null,null,null,null,null,null,153]
[null,"ਵਿਦਿਆਰਥੀ ਦੂਜਿਆਂ ਦੀ ਸਮਾਨਤਾ ਅਤੇ ਵਿਭਿੰਨਤਾ ਦੀ ਕਦਰ ਕਰਦਾ ਹੈ।\n",null,null,null,null,null,null,null,null,null,null,null,null,null,null,null,"",null,"",null,"",null,null,null,null,null,null,null,null,null,null,null,null,null,154]
[null,"Creativity (ਰਚਨਾਤਮਕਤਾ)",null,null,null,null,null,null,null,null,null,null,null,null,null,null,null,null,null,null,null,null,null,null,null,null,null,null,null,null,null,null,null,null,null,155]
[null,"ਆਲੋਚਨਾਤਮਕ ਸੋਚ (Critical Thinking)",null,null,null,null,null,null,null,null,null,null,null,null,null,null,null,null,null,null,null,null,null,null,null,null,null,null,null,null,null,null,null,null,null,156]
[null,"ਵਿਦਿਆਰਥੀ ਇਸ ਗੱਲ ਦਾ ਵਿਸ਼ਲੇਸ਼ਣ ਕਰਦਾ ਹੈ ਕਿ ਇੱਕ ਪ੍ਰਣਾਲੀ ਦੇ ਵੱਖ-ਵੱਖ ਭਾਗ ਆਪਸੀ ਸਹਿਭਾਗਤਾ ਨਾਲ ਕੰਮ ਕਰਦੇ ਹਨ।",null,null,null,null,null,null,null,null,null,null,null,null,null,null,null,{"$f":"IF(OR($M$134=\"D\",$M$134=\"C+\",$M$134=\"C\"),\"P\",\"\")","v":""},null,{"$f":"IF(OR($M$134=\"A\",$M$134=\"B+\"),\"P\",\"\")","v":""},null,{"$f":"IF($M$134=\"A+\",\"P\",\"\")","v":""},null,null,null,null,null,null,null,null,null,null,null,null,null,157]
[null,"ਸਬੂਤਾਂ, ਤਰਕਾਂ ਦਾਅਵੇ ਅਤੇ ਵਿਸ਼ਵਾਸਾਂ ਅਤੇ ਵਿਕਲਪਿਕ ਨਜ਼ਰੀਏ ਦਾ ਪ੍ਰਭਾਵਸ਼ਾਲੀ ਤਰੀਕੇ ਨਾਲ਼ ਵਿਸ਼ਲੇਸ਼ਣ ਅਤੇ ਮੁਲਾਂਕਣ ਕਰਦਾ ਹੈ।",null,null,null,null,null,null,null,null,null,null,null,null,null,null,null,"",null,"",null,"",null,null,null,null,null,null,null,null,null,null,null,null,null,158]
[null,"ਉਪਲਬਧ ਸੂਚਨਾ ਦਾ ਸਹੀ ਵਿਸ਼ਲੇਸ਼ਣ ਰਾਹੀ ਵਧੀਆ ਪਰਿਣਾਮ ਪ੍ਰਾਪਤ ਕਰ ਸਕਦਾ ਹੈ।",null,null,null,null,null,null,null,null,null,null,null,null,null,null,null,"",null,"",null,"",null,null,null,null,null,null,null,null,null,null,null,null,null,159]
[null,"ਕਿਸੇ ਵਿਚਾਰ ਦੀ ਪੜਤਾਲ ਅਤੇ ਵਿਸ਼ਲੇਸ਼ਣ ਕਰਨ ਲਈ ਤਰਕ ਅਤੇ ਕਸੌਟੀ ਦੀ ਵਰਤੋਂ ਕਰਦਾ ਹੈ",null,null,null,null,null,null,null,null,null,null,null,null,null,null,null,"",null,"",null,"",null,null,null,null,null,null,null,null,null,null,null,null,null,160]
[null,"ਵਿਦਿਆਰਥੀ ਆਪਣੀ ਸੋਚ ਅਤੇ ਵਿਚਾਰਾਂ ਦੀ ਪੜਚੋਲ ਕਰਦਾ ਹੈ।",null,null,null,null,null,null,null,null,null,null,null,null,null,null,null,"",null,"",null,"",null,null,null,null,null,null,null,null,null,null,null,null,null,161]
[null,"ਵਿਦਿਆਰਥੀ ਇਮਾਨਦਾਰੀ ਅਤੇ ਨਿਰਪੱਖਤਾ ਵਰਗੀਆਂ ਕੀਮਤਾਂ ਦੀ ਕਦਰ ਕਰਦਾ ਹੈ।",null,null,null,null,null,null,null,null,null,null,null,null,null,null,null,"",null,"",null,"",null,null,null,null,null,null,null,null,null,null,null,null,null,162]
[null,"ਸਮੱਸਿਆ ਦਾ ਹੱਲ ਲੱਭਣਾ(Problem Solving)",null,null,null,null,null,null,null,null,null,null,null,null,null,null,null,null,null,null,null,null,null,null,null,null,null,null,null,null,null,null,null,null,null,163]
[null,"ਕੁਝ ਨਵਾਂ ਜਾਨਣ ਦੀ ਜਿਗਿਆਸਾ ਰੱਖਦਾ ਹੈ।",null,null,null,null,null,null,null,null,null,null,null,null,null,null,null,"",null,"",null,"",null,null,null,null,null,null,null,null,null,null,null,null,null,164]
[null,"ਗਿਆਨ, ਕੌਸ਼ਲ ਅਤੇ ਧਾਰਨਾ ਨਾਲ ਸੰਬੰਧਤ ਪ੍ਰਸ਼ਨ ਪੁੱਛਦਾ ਹੈ।",null,null,null,null,null,null,null,null,null,null,null,null,null,null,null,"",null,"",null,"",null,null,null,null,null,null,null,null,null,null,null,null,null,165]
[null,"ਕਿਸੇ ਵੀ ਨਵੀਂ ਸਮੱਸਿਆ ਦਾ ਪਾਰੰਪਰਿਕ ਅਤੇ ਨਵੀਨ ਤਰੀਕਿਆਂ ਨਾਲ ਹੱਲ ਕਰਦਾ ਹੈ।",null,null,null,null,null,null,null,null,null,null,null,null,null,null,null,"",null,"",null,"",null,null,null,null,null,null,null,null,null,null,null,null,null,166]
[null,"ਅਜਿਹੇ ਮੋਹਤਵਪੂਰਨ ਪ੍ਰਸ਼ਨ ਪੁੱਛਦਾ ਹੈ, ਜੋ ਕਿਸੇ ਸਮੱਸਿਆ ਦੇ ਹੱਲ ਲਈ ਸੰਭਵ ਵੱਖ-ਵੱਖ ਨਜ਼ਰੀਏ ਨੂੰ ਸਪਸ਼ਟ ਕਰਦਾ ਹੈ ਅਤੇ ਸਮੱਸਿਆ ਦੇ ਬਿਹਤਰ ਹੱਲ ਤੱਕ ਪੁੱਜਦਾ ਹੈ।",null,null,null,null,null,null,null,null,null,null,null,null,null,null,null,"",null,"",null,"",null,null,null,null,null,null,null,null,null,null,null,null,null,167]
[null,"ਸੂਚਨਾ ਪ੍ਰਬੰਧਨ (Information Management)",null,null,null,null,null,null,null,null,null,null,null,null,null,null,null,null,null,null,null,null,null,null,null,null,null,null,null,null,null,null,null,null,null,168]
[null,"ਕਿਸੇ ਸੂਚਨਾ ਨੂੰ ਪ੍ਰਾਪਤ ਕਰਨ ਲਈ ਪ੍ਰਭਾਵਸ਼ਾਲੀ ਸੋਮੇ ਖੋਜਦਾ ਹੈ।",null,null,null,null,null,null,null,null,null,null,null,null,null,null,null,"",null,"",null,"",null,null,null,null,null,null,null,null,null,null,null,null,null,169]
[null,"ਪ੍ਰਾਪਤ ਹੋਈ ਸੂਚਨਾ ਦੀ ਪੜਚੋਲ ਕਰਦਾ ਹੈ।",null,null,null,null,null,null,null,null,null,null,null,null,null,null,null,"",null,"",null,"",null,null,null,null,null,null,null,null,null,null,null,null,null,170]
[null,"ਪ੍ਰਾਪਤ ਸੂਚਨਾ ਨੂੰ ਕਿਸੇ ਸਮੱਸਿਆ ਦਾ ਨਿਪਟਾਰਾ ਕਰਨ ਲਈ ਸਟੀਕ ਅਤੇ ਰਚਨਾਤਮਕ ਢੰਗ ਨਾਲ ਵਰਤਦਾ ਹੈ।\n",null,null,null,null,null,null,null,null,null,null,null,null,null,null,null,"",null,"",null,"",null,null,null,null,null,null,null,null,null,null,null,null,null,171]
[null,"ਵੱਖ-ਵੱਖ ਸੋਮਿਆਂ ਤੋਂ ਪ੍ਰਾਪਤ ਹੋਈ ਸੂਚਨਾ ਦੇ ਪ੍ਰਵਾਹ ਦਾ ਪ੍ਰਬੰਧਨ ਕਰਦਾ ਹੈ।",null,null,null,null,null,null,null,null,null,null,null,null,null,null,null,"",null,"",null,"",null,null,null,null,null,null,null,null,null,null,null,null,null,172]
[null,"ਸਿਰਜਨਾਤਮਕਤਾ ਅਤੇ ਨਵੀਨਤਾ(Creativity and Innovation)",null,null,null,null,null,null,null,null,null,null,null,null,null,null,null,null,null,null,null,null,null,null,null,null,null,null,null,null,null,null,null,null,null,173]
[null,"ਨਵੇਂ ਵਿਚਾਰਾਂ ਦੀ ਸਿਰਜਨਾ ਕਰਦਾ ਹੈ।",null,null,null,null,null,null,null,null,null,null,null,null,null,null,null,"",null,"",null,"",null,null,null,null,null,null,null,null,null,null,null,null,null,174]
[null,"ਨਵੇਂ ਵਿਚਾਰਾਂ ਨੂੰ ਦੂਜਿਆਂ ਤੱਕ ਸੰਚਾਰ ਕਰ ਸਕਦਾ ਹੈ ਅਤੇ ਲਾਗੂ ਵੀ ਕਰ ਸਕਦਾ ਹੈ ।",null,null,null,null,null,null,null,null,null,null,null,null,null,null,null,"",null,"",null,"",null,null,null,null,null,null,null,null,null,null,null,null,null,175]
[null,"ਗਰੁੱਪ ਵਿੱਚ ਕੰਮ ਕਰਦੇ ਦੂਜਿਆਂ ਦੇ ਵਿਚਾਰਾਂ ਨੂੰ ਵੀ ਸਹਿਜਤਾ ਨਾਲ ਗ੍ਰਹਿਣ ਕਰਦਾ ਹੈ ਅਤੇ ਉਨ੍ਹਾਂ ਨੂੰ ਲਾਗੂ ਕਰਦਾ ਹੈ।",null,null,null,null,null,null,null,null,null,null,null,null,null,null,null,"",null,"",null,"",null,null,null,null,null,null,null,null,null,null,null,null,null,176]
[null,"ਨਵੇਂ ਹਲਾਤਾਂ ਨਾਲ ਬਹੁਤ ਜਲਦੀ ਅਨੁਕੂਲਿਤ ਹੋ ਜਾਂਦਾ ਹੈ।",null,null,null,null,null,null,null,null,null,null,null,null,null,null,null,"",null,"",null,"",null,null,null,null,null,null,null,null,null,null,null,null,null,177]
[null,"ਨਵੇਂ ਹਲਾਤਾਂ ਨਾਲ ਬਹੁਤ ਜਲਦੀ ਅਨੁਕੂਲਿਤ ਹੋ ਜਾਂਦਾ ਹੈ।",null,null,null,null,null,null,null,null,null,null,null,null,null,null,null,"",null,"",null,"",null,null,null,null,null,null,null,null,null,null,null,null,null,178]
[null,"ਸਕਾਰਾਤਮਕਤਾ ਦਾ ਪ੍ਰਦਰਸ਼ਨ ਕਰਦਾ ਹੈ।",null,null,null,null,null,null,null,null,null,null,null,null,null,null,null,"",null,"",null,"",null,null,null,null,null,null,null,null,null,null,null,null,null,179]
[null,"ਸਰਬਪੱਖੀ ਪ੍ਰਗਤੀ ਕਾਰਡ",null,null,null,null,null,null,null,null,null,null,null,null,null,null,null,null,null,null,null,null,null,null,null,null,null,null,null,null,null,null,null,null,null,180]
[null,null,null,null,"ਵਿਦਿਆਰਥੀ ਦੀ ਸਹਿ-ਵਿੱਦਿਅਕ / ਵਾਧੂ-ਪਾਠਕ੍ਰਮ ਗਤੀਵਿਧੀਆਂ ਅਤੇ ਖੇਡਾਂ ਵਿੱਚ ਸਕੂਲ / ਬਲਾਕ/\n ਜ਼ਿਲਾ ਜਾਂ ਰਾਜ ਪੱਧਰ ਤੇ ਭਾਗੀਦਾਰੀ ਬਾਰੇ ਅਧਿਆਪਕ ਦੀ ਵਿਸਥਾਰਿਤ ਟਿੱਪਣੀ",null,null,null,null,null,null,null,null,null,null,null,null,null,null,null,null,null,null,null,null,null,null,null,null,null,null,null,null,null,null,181]
[null,"ਟਰਮ -1",null,null,null,null,null,null,null,null,null,null,null,null,null,null,null,null,null,null,null,null,null,null,null,null,null,null,null,null,null,null,null,null,null,182]
[null,null,null,null,{"$f":"IFERROR(VLOOKUP($AB$6,'Entry Sheet'!B7:$FL$500,167),\"\")","v":0},null,null,null,null,null,null,null,null,null,null,null,null,null,null,null,null,null,null,null,null,null,null,null,null,null,null,null,null,null,null,183]
[null,null,null,null,null,null,null,null,null,null,null,null,null,null,null,null,null,null,null,null,null,null,null,null,null,null,null,null,null,null,null,null,null,null,null,184]
[null,null,null,null,null,null,null,null,null,null,null,null,null,null,null,null,null,null,null,null,null,null,null,null,null,null,null,null,null,null,null,null,null,null,null,185]
[null,"ਟਰਮ-2 / \nਪ੍ਰੀ ਬੋਰਡ ",null,null,null,null,null,null,null,null,null,null,null,null,null,null,null,null,null,null,null,null,null,null,null,null,null,null,null,null,null,null,null,null,null,186]
[null,null,null,null,{"$f":"IFERROR(VLOOKUP($AB$6,'Entry Sheet'!B7:$FN$500,168),\"\")","v":0},null,null,null,null,null,null,null,null,null,null,null,null,null,null,null,null,null,null,null,null,null,null,null,null,null,null,null,null,null,null,187]
[null,null,null,null,null,null,null,null,null,null,null,null,null,null,null,null,null,null,null,null,null,null,null,null,null,null,null,null,null,null,null,null,null,null,null,188]
[null,null,null,null,null,null,null,null,null,null,null,null,null,null,null,null,null,null,null,null,null,null,null,null,null,null,null,null,null,null,null,null,null,null,null,189]
[null,"ਸਲਾਨਾ \nਪ੍ਰੀਖਿਆ",null,null,null,null,null,null,null,null,null,null,null,null,null,null,null,null,null,null,null,null,null,null,null,null,null,null,null,null,null,null,null,null,null,190]
[null,null,null,null,{"$f":"IFERROR(VLOOKUP($AB$6,'Entry Sheet'!B7:$FN$500,169),\"\")","v":0},null,null,null,null,null,null,null,null,null,null,null,null,null,null,null,null,null,null,null,null,null,null,null,null,null,null,null,null,null,null,191]
[null,null,null,null,null,null,null,null,null,null,null,null,null,null,null,null,null,null,null,null,null,null,null,null,null,null,null,null,null,null,null,null,null,null,null,192]
[null,null,null,null,null,null,null,null,null,null,null,null,null,null,null,null,null,null,null,null,null,null,null,null,null,null,null,null,null,null,null,null,null,null,null,193]
[null,null,null,null,null,null,null,null,null,null,null,null,null,null,null,null,null,null,null,null,null,null,null,null,null,null,null,null,null,null,null,null,null,null,null,194]
[null,null,null,null,"ਜਮਾਤ ਇੰਚਾਰਜ ਦੇ ਹਸਤਾਖ਼ਰ",null,null,null,null,null,"ਸਕੂਲ ਮੁੱਖੀ ਦੇ ਹਸਤਾਖ਼ਰ",null,null,null,null,null,null,"ਮਾਤਾ/ਪਿਤਾ/ਸਰਪ੍ਰਸਤ ਦੇ ਹਸਤਾਖ਼ਰ",null,null,null,null,null,null,null,null,null,null,null,null,null,null,null,null,null,195]
[null,"ਟਰਮ-1\n",null,null,null,null,null,null,null,null,null,null,null,null,null,null,null,null,null,null,null,null,null,null,null,null,null,null,null,null,null,null,null,null,null,196]
[null,"ਟਰਮ-2 / \nਪ੍ਰੀ ਬੋਰਡ ",null,null,null,null,null,null,null,null,null,null,null,null,null,null,null,null,null,null,null,null,null,null,null,null,null,null,null,null,null,null,null,null,null,197]
[null,"ਸਲਾਨਾ \nਪ੍ਰੀਖਿਆ",null,null,null,null,null,null,null,null,null,null,null,null,null,null,null,null,null,null,null,null,null,null,null,null,null,null,null,null,null,null,null,null,null,198]
[null,"ਸਕੂਲ ਸਿੱਖਿਆ ਵਿਭਾਗ, ਪੰਜਾਬ",null,null,null,null,null,null,null,null,null,null,null,null,null,null,null,null,null,null,null,null,null,null,null,null,null,null,null,null,null,null,null,null,null,199]
["www.Teachershelp.in",null,null,null,null,null,null,null,null,null,null,null,null,null,null,null,null,null,null,null,null,null,null,null,null,null,null,null,null,null,null,null,null,null,null,200]
[null,null,null,null,null,null,null,null,null,null,null,null,null,null,null,null,null,null,null,null,null,null,null,null,null,null,null,null,null,null,null,null,null,null,null,201]
[null,null,null,null,null,null,null,null,null,null,null,null,null,null,null,null,null,null,null,null,null,null,null,null,null,null,null,null,null,null,null,null,null,null,null,202]
[null,null,null,null,null,null,null,null,null,null,null,null,null,null,null,null,null,null,null,null,null,null,null,null,null,null,null,null,null,null,null,null,null,null,null,203]
[null,null,null,null,null,null,null,null,null,null,null,null,null,null,null,null,null,null,null,null,null,null,null,null,null,null,null,null,null,null,null,null,null,null,null,204]
[null,null,null,null,null,null,null,null,null,null,null,null,null,null,null,null,null,null,null,null,null,null,null,null,null,null,null,null,null,null,null,null,null,null,null,205]
[null,null,null,null,null,null,null,null,null,null,null,null,null,null,null,null,null,null,null,null,null,null,null,null,null,null,null,null,null,null,null,null,null,null,null,206]
[null,null,null,null,null,null,null,null,null,null,null,null,null,null,null,null,null,null,null,null,null,null,null,null,null,null,null,null,null,null,null,null,null,null,null,207]
[null,null,null,null,null,null,null,null,null,null,null,null,null,null,null,null,null,null,null,null,null,null,null,null,null,null,null,null,null,null,null,null,null,null,null,208]
[null,null,null,null,null,null,null,null,null,null,null,null,null,null,null,null,null,null,null,null,null,null,null,null,null,null,null,null,null,null,null,null,null,null,null,209]
[null,null,null,null,null,null,null,null,null,null,null,null,null,null,null,null,null,null,null,null,null,null,null,null,null,null,null,null,null,null,null,null,null,null,null,210]
[null,null,null,null,null,null,null,null,null,null,null,null,null,null,null,null,null,null,null,null,null,null,null,null,null,null,null,null,null,null,null,null,null,null,null,211]
[null,null,null,null,null,null,null,null,null,null,null,null,null,null,null,null,null,null,null,null,null,null,null,null,null,null,null,null,null,null,null,null,null,null,null,212]
[null,null,null,null,null,null,null,null,null,null,null,null,null,null,null,null,null,null,null,null,null,null,null,null,null,null,null,null,null,null,null,null,null,null,null,213]
[null,null,null,null,null,null,null,null,null,null,null,null,null,null,null,null,null,null,null,null,null,null,null,null,null,null,null,null,null,null,null,null,null,null,null,214]
[null,null,null,null,null,null,null,null,null,null,null,null,null,null,null,null,null,null,null,null,null,null,null,null,null,null,null,null,null,null,null,null,null,null,null,215]
[null,null,null,null,null,null,null,null,null,null,null,null,null,null,null,null,null,null,null,null,null,null,null,null,null,null,null,null,null,null,null,null,null,null,null,216]
[null,null,null,null,null,null,null,null,null,null,null,null,null,null,null,null,null,null,null,null,null,null,null,null,null,null,null,null,null,null,null,null,null,null,null,217]
[null,null,null,null,null,null,null,null,null,null,null,null,null,null,null,null,null,null,null,null,null,null,null,null,null,null,null,null,null,null,null,null,null,null,null,218]
[null,null,null,null,null,null,null,null,null,null,null,null,null,null,null,null,null,null,null,null,null,null,null,null,null,null,null,null,null,null,null,null,null,null,null,219]
[null,null,null,null,null,null,null,null,null,null,null,null,null,null,null,null,null,null,null,null,null,null,null,null,null,null,null,null,null,null,null,null,null,null,null,220]
[null,null,null,null,null,null,null,null,null,null,null,null,null,null,null,null,null,null,null,null,null,null,null,null,null,null,null,null,null,null,null,null,null,null,null,221]
[null,null,null,null,null,null,null,null,null,null,null,null,null,null,null,null,null,null,null,null,null,null,null,null,null,null,null,null,null,null,null,null,null,null,null,222]
[null,null,null,null,null,null,null,null,null,null,null,null,null,null,null,null,null,null,null,null,null,null,null,null,null,null,null,null,null,null,null,null,null,null,null,223]
[null,null,null,null,null,null,null,null,null,null,null,null,null,null,null,null,null,null,null,null,null,null,null,null,null,null,null,null,null,null,null,null,null,null,null,224]
[null,null,null,null,null,null,null,null,null,null,null,null,null,null,null,null,null,null,null,null,null,null,null,null,null,null,null,null,null,null,null,null,null,null,null,225]
[null,null,null,null,null,null,null,null,null,null,null,null,null,null,null,null,null,null,null,null,null,null,null,null,null,null,null,null,null,null,null,null,null,null,null,226]
[null,null,null,null,null,null,null,null,null,null,null,null,null,null,null,null,null,null,null,null,null,null,null,null,null,null,null,null,null,null,null,null,null,null,null,227]
[null,null,null,null,null,null,null,null,null,null,null,null,null,null,null,null,null,null,null,null,null,null,null,null,null,null,null,null,null,null,null,null,null,null,null,228]
[null,null,null,null,null,null,null,null,null,null,null,null,null,null,null,null,null,null,null,null,null,null,null,null,null,null,null,null,null,null,null,null,null,null,null,229]
[null,null,null,null,null,null,null,null,null,null,null,null,null,null,null,null,null,null,null,null,null,null,null,null,null,null,null,null,null,null,null,null,null,null,null,230]
[null,null,null,null,null,null,null,null,null,null,null,null,null,null,null,null,null,null,null,null,null,null,null,null,null,null,null,null,null,null,null,null,null,null,null,231]
[null,null,null,null,null,null,null,null,null,null,null,null,null,null,null,null,null,null,null,null,null,null,null,null,null,null,null,null,null,null,null,null,null,null,null,232]
[null,null,null,null,null,null,null,null,null,null,null,null,null,null,null,null,null,null,null,null,null,null,null,null,null,null,null,null,null,null,null,null,null,null,null,233]
[null,null,null,null,null,null,null,null,null,null,null,null,null,null,null,null,null,null,null,null,null,null,null,null,null,null,null,null,null,null,null,null,null,null,null,234]
[null,null,null,null,null,null,null,null,null,null,null,null,null,null,null,null,null,null,null,null,null,null,null,null,null,null,null,null,null,null,null,null,null,null,null,235]
[null,null,null,null,null,null,null,null,null,null,null,null,null,null,null,null,null,null,null,null,null,null,null,null,null,null,null,null,null,null,null,null,null,null,null,236]
[null,null,null,null,null,null,null,null,null,null,null,null,null,null,null,null,null,null,null,null,null,null,null,null,null,null,null,null,null,null,null,null,null,null,null,237]
[null,null,null,null,null,null,null,null,null,null,null,null,null,null,null,null,null,null,null,null,null,null,null,null,null,null,null,null,null,null,null,null,null,null,null,238]
[null,null,null,null,null,null,null,null,null,null,null,null,null,null,null,null,null,null,null,null,null,null,null,null,null,null,null,null,null,null,null,null,null,null,null,239]
[null,null,null,null,null,null,null,null,null,null,null,null,null,null,null,null,null,null,null,null,null,null,null,null,null,null,null,null,null,null,null,null,null,null,null,240]
[null,null,null,null,null,null,null,null,null,null,null,null,null,null,null,null,null,null,null,null,null,null,null,null,null,null,null,null,null,null,null,null,null,null,null,241]
[null,null,null,null,null,null,null,null,null,null,null,null,null,null,null,null,null,null,null,null,null,null,null,null,null,null,null,null,null,null,null,null,null,null,null,242]
[null,null,null,null,null,null,null,null,null,null,null,null,null,null,null,null,null,null,null,null,null,null,null,null,null,null,null,null,null,null,null,null,null,null,null,243]
[null,null,null,null,null,null,null,null,null,null,null,null,null,null,null,null,null,null,null,null,null,null,null,null,null,null,null,null,null,null,null,null,null,null,null,244]
[null,null,null,null,null,null,null,null,null,null,null,null,null,null,null,null,null,null,null,null,null,null,null,null,null,null,null,null,null,null,null,null,null,null,null,245]
[null,null,null,null,null,null,null,null,null,null,null,null,null,null,null,null,null,null,null,null,null,null,null,null,null,null,null,null,null,null,null,null,null,null,null,246]
[null,null,null,null,null,null,null,null,null,null,null,null,null,null,null,null,null,null,null,null,null,null,null,null,null,null,null,null,null,null,null,null,null,null,null,247]
[null,null,null,null,null,null,null,null,null,null,null,null,null,null,null,null,null,null,null,null,null,null,null,null,null,null,null,null,null,null,null,null,null,null,null,248]
[null,null,null,null,null,null,null,null,null,null,null,null,null,null,null,null,null,null,null,null,null,null,null,null,null,null,null,null,null,null,null,null,null,null,null,249]
[null,null,null,null,null,null,null,null,null,null,null,null,null,null,null,null,null,null,null,null,null,null,null,null,null,null,null,null,null,null,null,null,null,null,null,250]
[null,null,null,null,null,null,null,null,null,null,null,null,null,null,null,null,null,null,null,null,null,null,null,null,null,null,null,null,null,null,null,null,null,null,null,251]
[null,null,null,null,null,null,null,null,null,null,null,null,null,null,null,null,null,null,null,null,null,null,null,null,null,null,null,null,null,null,null,null,null,null,null,252]
[null,null,null,null,null,null,null,null,null,null,null,null,null,null,null,null,null,null,null,null,null,null,null,null,null,null,null,null,null,null,null,null,null,null,null,253]
[null,null,null,null,null,null,null,null,null,null,null,null,null,null,null,null,null,null,null,null,null,null,null,null,null,null,null,null,null,null,null,null,null,null,null,254]
[null,null,null,null,null,null,null,null,null,null,null,null,null,null,null,null,null,null,null,null,null,null,null,null,null,null,null,null,null,null,null,null,null,null,null,255]
[null,null,null,null,null,null,null,null,null,null,null,null,null,null,null,null,null,null,null,null,null,null,null,null,null,null,null,null,null,null,null,null,null,null,null,256]
[null,null,null,null,null,null,null,null,null,null,null,null,null,null,null,null,null,null,null,null,null,null,null,null,null,null,null,null,null,null,null,null,null,null,null,257]
[null,null,null,null,null,null,null,null,null,null,null,null,null,null,null,null,null,null,null,null,null,null,null,null,null,null,null,null,null,null,null,null,null,null,null,258]
[null,null,null,null,null,null,null,null,null,null,null,null,null,null,null,null,null,null,null,null,null,null,null,null,null,null,null,null,null,null,null,null,null,null,null,259]
[null,null,null,null,null,null,null,null,null,null,null,null,null,null,null,null,null,null,null,null,null,null,null,null,null,null,null,null,null,null,null,null,null,null,null,260]
[null,null,null,null,null,null,null,null,null,null,null,null,null,null,null,null,null,null,null,null,null,null,null,null,null,null,null,null,null,null,null,null,null,null,null,261]
[null,null,null,null,null,null,null,null,null,null,null,null,null,null,null,null,null,null,null,null,null,null,null,null,null,null,null,null,null,null,null,null,null,null,null,262]
[null,null,null,null,null,null,null,null,null,null,null,null,null,null,null,null,null,null,null,null,null,null,null,null,null,null,null,null,null,null,null,null,null,null,null,263]
[null,null,null,null,null,null,null,null,null,null,null,null,null,null,null,null,null,null,null,null,null,null,null,null,null,null,null,null,null,null,null,null,null,null,null,264]
[null,null,null,null,null,null,null,null,null,null,null,null,null,null,null,null,null,null,null,null,null,null,null,null,null,null,null,null,null,null,null,null,null,null,null,265]
[null,null,null,null,null,null,null,null,null,null,null,null,null,null,null,null,null,null,null,null,null,null,null,null,null,null,null,null,null,null,null,null,null,null,null,266]
[null,null,null,null,null,null,null,null,null,null,null,null,null,null,null,null,null,null,null,null,null,null,null,null,null,null,null,null,null,null,null,null,null,null,null,267]
[null,null,null,null,null,null,null,null,null,null,null,null,null,null,null,null,null,null,null,null,null,null,null,null,null,null,null,null,null,null,null,null,null,null,null,268]
[null,null,null,null,null,null,null,null,null,null,null,null,null,null,null,null,null,null,null,null,null,null,null,null,null,null,null,null,null,null,null,null,null,null,null,269]
[null,null,null,null,null,null,null,null,null,null,null,null,null,null,null,null,null,null,null,null,null,null,null,null,null,null,null,null,null,null,null,null,null,null,null,270]
[null,null,null,null,null,null,null,null,null,null,null,null,null,null,null,null,null,null,null,null,null,null,null,null,null,null,null,null,null,null,null,null,null,null,null,271]
[null,null,null,null,null,null,null,null,null,null,null,null,null,null,null,null,null,null,null,null,null,null,null,null,null,null,null,null,null,null,null,null,null,null,null,272]
[null,null,null,null,null,null,null,null,null,null,null,null,null,null,null,null,null,null,null,null,null,null,null,null,null,null,null,null,null,null,null,null,null,null,null,273]
[null,null,null,null,null,null,null,null,null,null,null,null,null,null,null,null,null,null,null,null,null,null,null,null,null,null,null,null,null,null,null,null,null,null,null,274]
[null,null,null,null,null,null,null,null,null,null,null,null,null,null,null,null,null,null,null,null,null,null,null,null,null,null,null,null,null,null,null,null,null,null,null,275]
[null,null,null,null,null,null,null,null,null,null,null,null,null,null,null,null,null,null,null,null,null,null,null,null,null,null,null,null,null,null,null,null,null,null,null,276]
[null,null,null,null,null,null,null,null,null,null,null,null,null,null,null,null,null,null,null,null,null,null,null,null,null,null,null,null,null,null,null,null,null,null,null,277]
[null,null,null,null,null,null,null,null,null,null,null,null,null,null,null,null,null,null,null,null,null,null,null,null,null,null,null,null,null,null,null,null,null,null,null,278]
[null,null,null,null,null,null,null,null,null,null,null,null,null,null,null,null,null,null,null,null,null,null,null,null,null,null,null,null,null,null,null,null,null,null,null,279]
[null,null,null,null,null,null,null,null,null,null,null,null,null,null,null,null,null,null,null,null,null,null,null,null,null,null,null,null,null,null,null,null,null,null,null,280]
[null,null,null,null,null,null,null,null,null,null,null,null,null,null,null,null,null,null,null,null,null,null,null,null,null,null,null,null,null,null,null,null,null,null,null,281]
[null,null,null,null,null,null,null,null,null,null,null,null,null,null,null,null,null,null,null,null,null,null,null,null,null,null,null,null,null,null,null,null,null,null,null,282]
[null,null,null,null,null,null,null,null,null,null,null,null,null,null,null,null,null,null,null,null,null,null,null,null,null,null,null,null,null,null,null,null,null,null,null,283]
[null,null,null,null,null,null,null,null,null,null,null,null,null,null,null,null,null,null,null,null,null,null,null,null,null,null,null,null,null,null,null,null,null,null,null,284]
[null,null,null,null,null,null,null,null,null,null,null,null,null,null,null,null,null,null,null,null,null,null,null,null,null,null,null,null,null,null,null,null,null,null,null,285]
[null,null,null,null,null,null,null,null,null,null,null,null,null,null,null,null,null,null,null,null,null,null,null,null,null,null,null,null,null,null,null,null,null,null,null,286]
[null,null,null,null,null,null,null,null,null,null,null,null,null,null,null,null,null,null,null,null,null,null,null,null,null,null,null,null,null,null,null,null,null,null,null,287]
[null,null,null,null,null,null,null,null,null,null,null,null,null,null,null,null,null,null,null,null,null,null,null,null,null,null,null,null,null,null,null,null,null,null,null,288]
[null,null,null,null,null,null,null,null,null,null,null,null,null,null,null,null,null,null,null,null,null,null,null,null,null,null,null,null,null,null,null,null,null,null,null,289]
[null,null,null,null,null,null,null,null,null,null,null,null,null,null,null,null,null,null,null,null,null,null,null,null,null,null,null,null,null,null,null,null,null,null,null,290]
[null,null,null,null,null,null,null,null,null,null,null,null,null,null,null,null,null,null,null,null,null,null,null,null,null,null,null,null,null,null,null,null,null,null,null,291]
[null,null,null,null,null,null,null,null,null,null,null,null,null,null,null,null,null,null,null,null,null,null,null,null,null,null,null,null,null,null,null,null,null,null,null,292]
[null,null,null,null,null,null,null,null,null,null,null,null,null,null,null,null,null,null,null,null,null,null,null,null,null,null,null,null,null,null,null,null,null,null,null,293]
[null,null,null,null,null,null,null,null,null,null,null,null,null,null,null,null,null,null,null,null,null,null,null,null,null,null,null,null,null,null,null,null,null,null,null,294]
[null,null,null,null,null,null,null,null,null,null,null,null,null,null,null,null,null,null,null,null,null,null,null,null,null,null,null,null,null,null,null,null,null,null,null,295]
[null,null,null,null,null,null,null,null,null,null,null,null,null,null,null,null,null,null,null,null,null,null,null,null,null,null,null,null,null,null,null,null,null,null,null,296]
[null,null,null,null,null,null,null,null,null,null,null,null,null,null,null,null,null,null,null,null,null,null,null,null,null,null,null,null,null,null,null,null,null,null,null,297]
[null,null,null,null,null,null,null,null,null,null,null,null,null,null,null,null,null,null,null,null,null,null,null,null,null,null,null,null,null,null,null,null,null,null,null,298]
[null,null,null,null,null,null,null,null,null,null,null,null,null,null,null,null,null,null,null,null,null,null,null,null,null,null,null,null,null,null,null,null,null,null,null,299]
[null,null,null,null,null,null,null,null,null,null,null,null,null,null,null,null,null,null,null,null,null,null,null,null,null,null,null,null,null,null,null,null,null,null,null,300]
[null,null,null,null,null,null,null,null,null,null,null,null,null,null,null,null,null,null,null,null,null,null,null,null,null,null,null,null,null,null,null,null,null,null,null,301]
[null,null,null,null,null,null,null,null,null,null,null,null,null,null,null,null,null,null,null,null,null,null,null,null,null,null,null,null,null,null,null,null,null,null,null,302]
[null,null,null,null,null,null,null,null,null,null,null,null,null,null,null,null,null,null,null,null,null,null,null,null,null,null,null,null,null,null,null,null,null,null,null,303]
[null,null,null,null,null,null,null,null,null,null,null,null,null,null,null,null,null,null,null,null,null,null,null,null,null,null,null,null,null,null,null,null,null,null,null,304]
[null,null,null,null,null,null,null,null,null,null,null,null,null,null,null,null,null,null,null,null,null,null,null,null,null,null,null,null,null,null,null,null,null,null,null,305]
[null,null,null,null,null,null,null,null,null,null,null,null,null,null,null,null,null,null,null,null,null,null,null,null,null,null,null,null,null,null,null,null,null,null,null,306]
[null,null,null,null,null,null,null,null,null,null,null,null,null,null,null,null,null,null,null,null,null,null,null,null,null,null,null,null,null,null,null,null,null,null,null,307]
[null,null,null,null,null,null,null,null,null,null,null,null,null,null,null,null,null,null,null,null,null,null,null,null,null,null,null,null,null,null,null,null,null,null,null,308]
[null,null,null,null,null,null,null,null,null,null,null,null,null,null,null,null,null,null,null,null,null,null,null,null,null,null,null,null,null,null,null,null,null,null,null,309]
[null,null,null,null,null,null,null,null,null,null,null,null,null,null,null,null,null,null,null,null,null,null,null,null,null,null,null,null,null,null,null,null,null,null,null,310]
[null,null,null,null,null,null,null,null,null,null,null,null,null,null,null,null,null,null,null,null,null,null,null,null,null,null,null,null,null,null,null,null,null,null,null,311]
[null,null,null,null,null,null,null,null,null,null,null,null,null,null,null,null,null,null,null,null,null,null,null,null,null,null,null,null,null,null,null,null,null,null,null,312]
[null,null,null,null,null,null,null,null,null,null,null,null,null,null,null,null,null,null,null,null,null,null,null,null,null,null,null,null,null,null,null,null,null,null,null,313]
[null,null,null,null,null,null,null,null,null,null,null,null,null,null,null,null,null,null,null,null,null,null,null,null,null,null,null,null,null,null,null,null,null,null,null,314]
[null,null,null,null,null,null,null,null,null,null,null,null,null,null,null,null,null,null,null,null,null,null,null,null,null,null,null,null,null,null,null,null,null,null,null,315]
[null,null,null,null,null,null,null,null,null,null,null,null,null,null,null,null,null,null,null,null,null,null,null,null,null,null,null,null,null,null,null,null,null,null,null,316]
[null,null,null,null,null,null,null,null,null,null,null,null,null,null,null,null,null,null,null,null,null,null,null,null,null,null,null,null,null,null,null,null,null,null,null,317]
[null,null,null,null,null,null,null,null,null,null,null,null,null,null,null,null,null,null,null,null,null,null,null,null,null,null,null,null,null,null,null,null,null,null,null,318]
[null,null,null,null,null,null,null,null,null,null,null,null,null,null,null,null,null,null,null,null,null,null,null,null,null,null,null,null,null,null,null,null,null,null,null,319]
[null,null,null,null,null,null,null,null,null,null,null,null,null,null,null,null,null,null,null,null,null,null,null,null,null,null,null,null,null,null,null,null,null,null,null,320]
[null,null,null,null,null,null,null,null,null,null,null,null,null,null,null,null,null,null,null,null,null,null,null,null,null,null,null,null,null,null,null,null,null,null,null,321]
[null,null,null,null,null,null,null,null,null,null,null,null,null,null,null,null,null,null,null,null,null,null,null,null,null,null,null,null,null,null,null,null,null,null,null,322]
[null,null,null,null,null,null,null,null,null,null,null,null,null,null,null,null,null,null,null,null,null,null,null,null,null,null,null,null,null,null,null,null,null,null,null,323]
[null,null,null,null,null,null,null,null,null,null,null,null,null,null,null,null,null,null,null,null,null,null,null,null,null,null,null,null,null,null,null,null,null,null,null,324]
[null,null,null,null,null,null,null,null,null,null,null,null,null,null,null,null,null,null,null,null,null,null,null,null,null,null,null,null,null,null,null,null,null,null,null,325]
[null,null,null,null,null,null,null,null,null,null,null,null,null,null,null,null,null,null,null,null,null,null,null,null,null,null,null,null,null,null,null,null,null,null,null,326]
[null,null,null,null,null,null,null,null,null,null,null,null,null,null,null,null,null,null,null,null,null,null,null,null,null,null,null,null,null,null,null,null,null,null,null,327]
[null,null,null,null,null,null,null,null,null,null,null,null,null,null,null,null,null,null,null,null,null,null,null,null,null,null,null,null,null,null,null,null,null,null,null,328]
[null,null,null,null,null,null,null,null,null,null,null,null,null,null,null,null,null,null,null,null,null,null,null,null,null,null,null,null,null,null,null,null,null,null,null,329]
[null,null,null,null,null,null,null,null,null,null,null,null,null,null,null,null,null,null,null,null,null,null,null,null,null,null,null,null,null,null,null,null,null,null,null,330]
[null,null,null,null,null,null,null,null,null,null,null,null,null,null,null,null,null,null,null,null,null,null,null,null,null,null,null,null,null,null,null,null,null,null,null,331]
[null,null,null,null,null,null,null,null,null,null,null,null,null,null,null,null,null,null,null,null,null,null,null,null,null,null,null,null,null,null,null,null,null,null,null,332]
[null,null,null,null,null,null,null,null,null,null,null,null,null,null,null,null,null,null,null,null,null,null,null,null,null,null,null,null,null,null,null,null,null,null,null,333]
[null,null,null,null,null,null,null,null,null,null,null,null,null,null,null,null,null,null,null,null,null,null,null,null,null,null,null,null,null,null,null,null,null,null,null,334]
[null,null,null,null,null,null,null,null,null,null,null,null,null,null,null,null,null,null,null,null,null,null,null,null,null,null,null,null,null,null,null,null,null,null,null,335]
[null,null,null,null,null,null,null,null,null,null,null,null,null,null,null,null,null,null,null,null,null,null,null,null,null,null,null,null,null,null,null,null,null,null,null,336]
[null,null,null,null,null,null,null,null,null,null,null,null,null,null,null,null,null,null,null,null,null,null,null,null,null,null,null,null,null,null,null,null,null,null,null,337]
[null,null,null,null,null,null,null,null,null,null,null,null,null,null,null,null,null,null,null,null,null,null,null,null,null,null,null,null,null,null,null,null,null,null,null,338]
[null,null,null,null,null,null,null,null,null,null,null,null,null,null,null,null,null,null,null,null,null,null,null,null,null,null,null,null,null,null,null,null,null,null,null,339]
[null,null,null,null,null,null,null,null,null,null,null,null,null,null,null,null,null,null,null,null,null,null,null,null,null,null,null,null,null,null,null,null,null,null,null,340]
[null,null,null,null,null,null,null,null,null,null,null,null,null,null,null,null,null,null,null,null,null,null,null,null,null,null,null,null,null,null,null,null,null,null,null,341]
[null,null,null,null,null,null,null,null,null,null,null,null,null,null,null,null,null,null,null,null,null,null,null,null,null,null,null,null,null,null,null,null,null,null,null,342]
[null,null,null,null,null,null,null,null,null,null,null,null,null,null,null,null,null,null,null,null,null,null,null,null,null,null,null,null,null,null,null,null,null,null,null,343]
[null,null,null,null,null,null,null,null,null,null,null,null,null,null,null,null,null,null,null,null,null,null,null,null,null,null,null,null,null,null,null,null,null,null,null,344]
[null,null,null,null,null,null,null,null,null,null,null,null,null,null,null,null,null,null,null,null,null,null,null,null,null,null,null,null,null,null,null,null,null,null,null,345]
[null,null,null,null,null,null,null,null,null,null,null,null,null,null,null,null,null,null,null,null,null,null,null,null,null,null,null,null,null,null,null,null,null,null,null,346]
[null,null,null,null,null,null,null,null,null,null,null,null,null,null,null,null,null,null,null,null,null,null,null,null,null,null,null,null,null,null,null,null,null,null,null,347]
[null,null,null,null,null,null,null,null,null,null,null,null,null,null,null,null,null,null,null,null,null,null,null,null,null,null,null,null,null,null,null,null,null,null,null,348]
[null,null,null,null,null,null,null,null,null,null,null,null,null,null,null,null,null,null,null,null,null,null,null,null,null,null,null,null,null,null,null,null,null,null,null,349]
[null,null,null,null,null,null,null,null,null,null,null,null,null,null,null,null,null,null,null,null,null,null,null,null,null,null,null,null,null,null,null,null,null,null,null,350]
[null,null,null,null,null,null,null,null,null,null,null,null,null,null,null,null,null,null,null,null,null,null,null,null,null,null,null,null,null,null,null,null,null,null,null,351]
[null,null,null,null,null,null,null,null,null,null,null,null,null,null,null,null,null,null,null,null,null,null,null,null,null,null,null,null,null,null,null,null,null,null,null,352]
[null,null,null,null,null,null,null,null,null,null,null,null,null,null,null,null,null,null,null,null,null,null,null,null,null,null,null,null,null,null,null,null,null,null,null,353]
[null,null,null,null,null,null,null,null,null,null,null,null,null,null,null,null,null,null,null,null,null,null,null,null,null,null,null,null,null,null,null,null,null,null,null,354]
[null,null,null,null,null,null,null,null,null,null,null,null,null,null,null,null,null,null,null,null,null,null,null,null,null,null,null,null,null,null,null,null,null,null,null,355]
[null,null,null,null,null,null,null,null,null,null,null,null,null,null,null,null,null,null,null,null,null,null,null,null,null,null,null,null,null,null,null,null,null,null,null,356]
[null,null,null,null,null,null,null,null,null,null,null,null,null,null,null,null,null,null,null,null,null,null,null,null,null,null,null,null,null,null,null,null,null,null,null,357]
[null,null,null,null,null,null,null,null,null,null,null,null,null,null,null,null,null,null,null,null,null,null,null,null,null,null,null,null,null,null,null,null,null,null,null,358]
[null,null,null,null,null,null,null,null,null,null,null,null,null,null,null,null,null,null,null,null,null,null,null,null,null,null,null,null,null,null,null,null,null,null,null,359]
[null,null,null,null,null,null,null,null,null,null,null,null,null,null,null,null,null,null,null,null,null,null,null,null,null,null,null,null,null,null,null,null,null,null,null,360]
[null,null,null,null,null,null,null,null,null,null,null,null,null,null,null,null,null,null,null,null,null,null,null,null,null,null,null,null,null,null,null,null,null,null,null,361]
[null,null,null,null,null,null,null,null,null,null,null,null,null,null,null,null,null,null,null,null,null,null,null,null,null,null,null,null,null,null,null,null,null,null,null,362]
[null,null,null,null,null,null,null,null,null,null,null,null,null,null,null,null,null,null,null,null,null,null,null,null,null,null,null,null,null,null,null,null,null,null,null,363]
[null,null,null,null,null,null,null,null,null,null,null,null,null,null,null,null,null,null,null,null,null,null,null,null,null,null,null,null,null,null,null,null,null,null,null,364]
[null,null,null,null,null,null,null,null,null,null,null,null,null,null,null,null,null,null,null,null,null,null,null,null,null,null,null,null,null,null,null,null,null,null,null,365]
[null,null,null,null,null,null,null,null,null,null,null,null,null,null,null,null,null,null,null,null,null,null,null,null,null,null,null,null,null,null,null,null,null,null,null,366]
[null,null,null,null,null,null,null,null,null,null,null,null,null,null,null,null,null,null,null,null,null,null,null,null,null,null,null,null,null,null,null,null,null,null,null,367]
[null,null,null,null,null,null,null,null,null,null,null,null,null,null,null,null,null,null,null,null,null,null,null,null,null,null,null,null,null,null,null,null,null,null,null,368]
[null,null,null,null,null,null,null,null,null,null,null,null,null,null,null,null,null,null,null,null,null,null,null,null,null,null,null,null,null,null,null,null,null,null,null,369]
[null,null,null,null,null,null,null,null,null,null,null,null,null,null,null,null,null,null,null,null,null,null,null,null,null,null,null,null,null,null,null,null,null,null,null,370]
[null,null,null,null,null,null,null,null,null,null,null,null,null,null,null,null,null,null,null,null,null,null,null,null,null,null,null,null,null,null,null,null,null,null,null,371]
[null,null,null,null,null,null,null,null,null,null,null,null,null,null,null,null,null,null,null,null,null,null,null,null,null,null,null,null,null,null,null,null,null,null,null,372]
[null,null,null,null,null,null,null,null,null,null,null,null,null,null,null,null,null,null,null,null,null,null,null,null,null,null,null,null,null,null,null,null,null,null,null,373]
[null,null,null,null,null,null,null,null,null,null,null,null,null,null,null,null,null,null,null,null,null,null,null,null,null,null,null,null,null,null,null,null,null,null,null,374]
[null,null,null,null,null,null,null,null,null,null,null,null,null,null,null,null,null,null,null,null,null,null,null,null,null,null,null,null,null,null,null,null,null,null,null,375]
[null,null,null,null,null,null,null,null,null,null,null,null,null,null,null,null,null,null,null,null,null,null,null,null,null,null,null,null,null,null,null,null,null,null,null,376]
[null,null,null,null,null,null,null,null,null,null,null,null,null,null,null,null,null,null,null,null,null,null,null,null,null,null,null,null,null,null,null,null,null,null,null,377]
[null,null,null,null,null,null,null,null,null,null,null,null,null,null,null,null,null,null,null,null,null,null,null,null,null,null,null,null,null,null,null,null,null,null,null,378]
[null,null,null,null,null,null,null,null,null,null,null,null,null,null,null,null,null,null,null,null,null,null,null,null,null,null,null,null,null,null,null,null,null,null,null,379]
[null,null,null,null,null,null,null,null,null,null,null,null,null,null,null,null,null,null,null,null,null,null,null,null,null,null,null,null,null,null,null,null,null,null,null,380]
[null,null,null,null,null,null,null,null,null,null,null,null,null,null,null,null,null,null,null,null,null,null,null,null,null,null,null,null,null,null,null,null,null,null,null,381]
[null,null,null,null,null,null,null,null,null,null,null,null,null,null,null,null,null,null,null,null,null,null,null,null,null,null,null,null,null,null,null,null,null,null,null,382]
[null,null,null,null,null,null,null,null,null,null,null,null,null,null,null,null,null,null,null,null,null,null,null,null,null,null,null,null,null,null,null,null,null,null,null,383]
[null,null,null,null,null,null,null,null,null,null,null,null,null,null,null,null,null,null,null,null,null,null,null,null,null,null,null,null,null,null,null,null,null,null,null,384]
[null,null,null,null,null,null,null,null,null,null,null,null,null,null,null,null,null,null,null,null,null,null,null,null,null,null,null,null,null,null,null,null,null,null,null,385]
[null,null,null,null,null,null,null,null,null,null,null,null,null,null,null,null,null,null,null,null,null,null,null,null,null,null,null,null,null,null,null,null,null,null,null,386]
[null,null,null,null,null,null,null,null,null,null,null,null,null,null,null,null,null,null,null,null,null,null,null,null,null,null,null,null,null,null,null,null,null,null,null,387]
[null,null,null,null,null,null,null,null,null,null,null,null,null,null,null,null,null,null,null,null,null,null,null,null,null,null,null,null,null,null,null,null,null,null,null,388]
[null,null,null,null,null,null,null,null,null,null,null,null,null,null,null,null,null,null,null,null,null,null,null,null,null,null,null,null,null,null,null,null,null,null,null,389]
[null,null,null,null,null,null,null,null,null,null,null,null,null,null,null,null,null,null,null,null,null,null,null,null,null,null,null,null,null,null,null,null,null,null,null,390]
[null,null,null,null,null,null,null,null,null,null,null,null,null,null,null,null,null,null,null,null,null,null,null,null,null,null,null,null,null,null,null,null,null,null,null,391]
[null,null,null,null,null,null,null,null,null,null,null,null,null,null,null,null,null,null,null,null,null,null,null,null,null,null,null,null,null,null,null,null,null,null,null,392]
[null,null,null,null,null,null,null,null,null,null,null,null,null,null,null,null,null,null,null,null,null,null,null,null,null,null,null,null,null,null,null,null,null,null,null,393]
[null,null,null,null,null,null,null,null,null,null,null,null,null,null,null,null,null,null,null,null,null,null,null,null,null,null,null,null,null,null,null,null,null,null,null,394]
[null,null,null,null,null,null,null,null,null,null,null,null,null,null,null,null,null,null,null,null,null,null,null,null,null,null,null,null,null,null,null,null,null,null,null,395]
[null,null,null,null,null,null,null,null,null,null,null,null,null,null,null,null,null,null,null,null,null,null,null,null,null,null,null,null,null,null,null,null,null,null,null,396]
[null,null,null,null,null,null,null,null,null,null,null,null,null,null,null,null,null,null,null,null,null,null,null,null,null,null,null,null,null,null,null,null,null,null,null,397]
[null,null,null,null,null,null,null,null,null,null,null,null,null,null,null,null,null,null,null,null,null,null,null,null,null,null,null,null,null,null,null,null,null,null,null,398]
[null,null,null,null,null,null,null,null,null,null,null,null,null,null,null,null,null,null,null,null,null,null,null,null,null,null,null,null,null,null,null,null,null,null,null,399]
[null,null,null,null,null,null,null,null,null,null,null,null,null,null,null,null,null,null,null,null,null,null,null,null,null,null,null,null,null,null,null,null,null,null,null,400]
[null,null,null,null,null,null,null,null,null,null,null,null,null,null,null,null,null,null,null,null,null,null,null,null,null,null,null,null,null,null,null,null,null,null,null,401]
[null,null,null,null,null,null,null,null,null,null,null,null,null,null,null,null,null,null,null,null,null,null,null,null,null,null,null,null,null,null,null,null,null,null,null,402]
[null,null,null,null,null,null,null,null,null,null,null,null,null,null,null,null,null,null,null,null,null,null,null,null,null,null,null,null,null,null,null,null,null,null,null,403]
[null,null,null,null,null,null,null,null,null,null,null,null,null,null,null,null,null,null,null,null,null,null,null,null,null,null,null,null,null,null,null,null,null,null,null,404]
[null,null,null,null,null,null,null,null,null,null,null,null,null,null,null,null,null,null,null,null,null,null,null,null,null,null,null,null,null,null,null,null,null,null,null,405]
[null,null,null,null,null,null,null,null,null,null,null,null,null,null,null,null,null,null,null,null,null,null,null,null,null,null,null,null,null,null,null,null,null,null,null,406]
[null,null,null,null,null,null,null,null,null,null,null,null,null,null,null,null,null,null,null,null,null,null,null,null,null,null,null,null,null,null,null,null,null,null,null,407]
[null,null,null,null,null,null,null,null,null,null,null,null,null,null,null,null,null,null,null,null,null,null,null,null,null,null,null,null,null,null,null,null,null,null,null,408]
[null,null,null,null,null,null,null,null,null,null,null,null,null,null,null,null,null,null,null,null,null,null,null,null,null,null,null,null,null,null,null,null,null,null,null,409]
[null,null,null,null,null,null,null,null,null,null,null,null,null,null,null,null,null,null,null,null,null,null,null,null,null,null,null,null,null,null,null,null,null,null,null,410]
[null,null,null,null,null,null,null,null,null,null,null,null,null,null,null,null,null,null,null,null,null,null,null,null,null,null,null,null,null,null,null,null,null,null,null,411]
[null,null,null,null,null,null,null,null,null,null,null,null,null,null,null,null,null,null,null,null,null,null,null,null,null,null,null,null,null,null,null,null,null,null,null,412]
[null,null,null,null,null,null,null,null,null,null,null,null,null,null,null,null,null,null,null,null,null,null,null,null,null,null,null,null,null,null,null,null,null,null,null,413]
[null,null,null,null,null,null,null,null,null,null,null,null,null,null,null,null,null,null,null,null,null,null,null,null,null,null,null,null,null,null,null,null,null,null,null,414]
[null,null,null,null,null,null,null,null,null,null,null,null,null,null,null,null,null,null,null,null,null,null,null,null,null,null,null,null,null,null,null,null,null,null,null,415]
[null,null,null,null,null,null,null,null,null,null,null,null,null,null,null,null,null,null,null,null,null,null,null,null,null,null,null,null,null,null,null,null,null,null,null,416]
[null,null,null,null,null,null,null,null,null,null,null,null,null,null,null,null,null,null,null,null,null,null,null,null,null,null,null,null,null,null,null,null,null,null,null,417]
[null,null,null,null,null,null,null,null,null,null,null,null,null,null,null,null,null,null,null,null,null,null,null,null,null,null,null,null,null,null,null,null,null,null,null,418]
[null,null,null,null,null,null,null,null,null,null,null,null,null,null,null,null,null,null,null,null,null,null,null,null,null,null,null,null,null,null,null,null,null,null,null,419]
[null,null,null,null,null,null,null,null,null,null,null,null,null,null,null,null,null,null,null,null,null,null,null,null,null,null,null,null,null,null,null,null,null,null,null,420]
[null,null,null,null,null,null,null,null,null,null,null,null,null,null,null,null,null,null,null,null,null,null,null,null,null,null,null,null,null,null,null,null,null,null,null,421]
[null,null,null,null,null,null,null,null,null,null,null,null,null,null,null,null,null,null,null,null,null,null,null,null,null,null,null,null,null,null,null,null,null,null,null,422]
[null,null,null,null,null,null,null,null,null,null,null,null,null,null,null,null,null,null,null,null,null,null,null,null,null,null,null,null,null,null,null,null,null,null,null,423]
[null,null,null,null,null,null,null,null,null,null,null,null,null,null,null,null,null,null,null,null,null,null,null,null,null,null,null,null,null,null,null,null,null,null,null,424]
[null,null,null,null,null,null,null,null,null,null,null,null,null,null,null,null,null,null,null,null,null,null,null,null,null,null,null,null,null,null,null,null,null,null,null,425]
[null,null,null,null,null,null,null,null,null,null,null,null,null,null,null,null,null,null,null,null,null,null,null,null,null,null,null,null,null,null,null,null,null,null,null,426]
[null,null,null,null,null,null,null,null,null,null,null,null,null,null,null,null,null,null,null,null,null,null,null,null,null,null,null,null,null,null,null,null,null,null,null,427]
[null,null,null,null,null,null,null,null,null,null,null,null,null,null,null,null,null,null,null,null,null,null,null,null,null,null,null,null,null,null,null,null,null,null,null,428]
[null,null,null,null,null,null,null,null,null,null,null,null,null,null,null,null,null,null,null,null,null,null,null,null,null,null,null,null,null,null,null,null,null,null,null,429]
[null,null,null,null,null,null,null,null,null,null,null,null,null,null,null,null,null,null,null,null,null,null,null,null,null,null,null,null,null,null,null,null,null,null,null,430]
[null,null,null,null,null,null,null,null,null,null,null,null,null,null,null,null,null,null,null,null,null,null,null,null,null,null,null,null,null,null,null,null,null,null,null,431]
[null,null,null,null,null,null,null,null,null,null,null,null,null,null,null,null,null,null,null,null,null,null,null,null,null,null,null,null,null,null,null,null,null,null,null,432]
[null,null,null,null,null,null,null,null,null,null,null,null,null,null,null,null,null,null,null,null,null,null,null,null,null,null,null,null,null,null,null,null,null,null,null,433]
[null,null,null,null,null,null,null,null,null,null,null,null,null,null,null,null,null,null,null,null,null,null,null,null,null,null,null,null,null,null,null,null,null,null,null,434]
[null,null,null,null,null,null,null,null,null,null,null,null,null,null,null,null,null,null,null,null,null,null,null,null,null,null,null,null,null,null,null,null,null,null,null,435]
[null,null,null,null,null,null,null,null,null,null,null,null,null,null,null,null,null,null,null,null,null,null,null,null,null,null,null,null,null,null,null,null,null,null,null,436]
[null,null,null,null,null,null,null,null,null,null,null,null,null,null,null,null,null,null,null,null,null,null,null,null,null,null,null,null,null,null,null,null,null,null,null,437]
[null,null,null,null,null,null,null,null,null,null,null,null,null,null,null,null,null,null,null,null,null,null,null,null,null,null,null,null,null,null,null,null,null,null,null,438]
[null,null,null,null,null,null,null,null,null,null,null,null,null,null,null,null,null,null,null,null,null,null,null,null,null,null,null,null,null,null,null,null,null,null,null,439]
[null,null,null,null,null,null,null,null,null,null,null,null,null,null,null,null,null,null,null,null,null,null,null,null,null,null,null,null,null,null,null,null,null,null,null,440]
[null,null,null,null,null,null,null,null,null,null,null,null,null,null,null,null,null,null,null,null,null,null,null,null,null,null,null,null,null,null,null,null,null,null,null,441]
[null,null,null,null,null,null,null,null,null,null,null,null,null,null,null,null,null,null,null,null,null,null,null,null,null,null,null,null,null,null,null,null,null,null,null,442]
[null,null,null,null,null,null,null,null,null,null,null,null,null,null,null,null,null,null,null,null,null,null,null,null,null,null,null,null,null,null,null,null,null,null,null,443]
[null,null,null,null,null,null,null,null,null,null,null,null,null,null,null,null,null,null,null,null,null,null,null,null,null,null,null,null,null,null,null,null,null,null,null,444]
[null,null,null,null,null,null,null,null,null,null,null,null,null,null,null,null,null,null,null,null,null,null,null,null,null,null,null,null,null,null,null,null,null,null,null,445]
[null,null,null,null,null,null,null,null,null,null,null,null,null,null,null,null,null,null,null,null,null,null,null,null,null,null,null,null,null,null,null,null,null,null,null,446]
[null,null,null,null,null,null,null,null,null,null,null,null,null,null,null,null,null,null,null,null,null,null,null,null,null,null,null,null,null,null,null,null,null,null,null,447]
[null,null,null,null,null,null,null,null,null,null,null,null,null,null,null,null,null,null,null,null,null,null,null,null,null,null,null,null,null,null,null,null,null,null,null,448]
[null,null,null,null,null,null,null,null,null,null,null,null,null,null,null,null,null,null,null,null,null,null,null,null,null,null,null,null,null,null,null,null,null,null,null,449]
[null,null,null,null,null,null,null,null,null,null,null,null,null,null,null,null,null,null,null,null,null,null,null,null,null,null,null,null,null,null,null,null,null,null,null,450]
[null,null,null,null,null,null,null,null,null,null,null,null,null,null,null,null,null,null,null,null,null,null,null,null,null,null,null,null,null,null,null,null,null,null,null,451]
[null,null,null,null,null,null,null,null,null,null,null,null,null,null,null,null,null,null,null,null,null,null,null,null,null,null,null,null,null,null,null,null,null,null,null,452]
[null,null,null,null,null,null,null,null,null,null,null,null,null,null,null,null,null,null,null,null,null,null,null,null,null,null,null,null,null,null,null,null,null,null,null,453]
[null,null,null,null,null,null,null,null,null,null,null,null,null,null,null,null,null,null,null,null,null,null,null,null,null,null,null,null,null,null,null,null,null,null,null,454]
[null,null,null,null,null,null,null,null,null,null,null,null,null,null,null,null,null,null,null,null,null,null,null,null,null,null,null,null,null,null,null,null,null,null,null,455]
[null,null,null,null,null,null,null,null,null,null,null,null,null,null,null,null,null,null,null,null,null,null,null,null,null,null,null,null,null,null,null,null,null,null,null,456]
[null,null,null,null,null,null,null,null,null,null,null,null,null,null,null,null,null,null,null,null,null,null,null,null,null,null,null,null,null,null,null,null,null,null,null,457]
[null,null,null,null,null,null,null,null,null,null,null,null,null,null,null,null,null,null,null,null,null,null,null,null,null,null,null,null,null,null,null,null,null,null,null,458]
[null,null,null,null,null,null,null,null,null,null,null,null,null,null,null,null,null,null,null,null,null,null,null,null,null,null,null,null,null,null,null,null,null,null,null,459]
[null,null,null,null,null,null,null,null,null,null,null,null,null,null,null,null,null,null,null,null,null,null,null,null,null,null,null,null,null,null,null,null,null,null,null,460]
[null,null,null,null,null,null,null,null,null,null,null,null,null,null,null,null,null,null,null,null,null,null,null,null,null,null,null,null,null,null,null,null,null,null,null,461]
[null,null,null,null,null,null,null,null,null,null,null,null,null,null,null,null,null,null,null,null,null,null,null,null,null,null,null,null,null,null,null,null,null,null,null,462]
[null,null,null,null,null,null,null,null,null,null,null,null,null,null,null,null,null,null,null,null,null,null,null,null,null,null,null,null,null,null,null,null,null,null,null,463]
[null,null,null,null,null,null,null,null,null,null,null,null,null,null,null,null,null,null,null,null,null,null,null,null,null,null,null,null,null,null,null,null,null,null,null,464]
[null,null,null,null,null,null,null,null,null,null,null,null,null,null,null,null,null,null,null,null,null,null,null,null,null,null,null,null,null,null,null,null,null,null,null,465]
[null,null,null,null,null,null,null,null,null,null,null,null,null,null,null,null,null,null,null,null,null,null,null,null,null,null,null,null,null,null,null,null,null,null,null,466]
[null,null,null,null,null,null,null,null,null,null,null,null,null,null,null,null,null,null,null,null,null,null,null,null,null,null,null,null,null,null,null,null,null,null,null,467]
[null,null,null,null,null,null,null,null,null,null,null,null,null,null,null,null,null,null,null,null,null,null,null,null,null,null,null,null,null,null,null,null,null,null,null,468]
[null,null,null,null,null,null,null,null,null,null,null,null,null,null,null,null,null,null,null,null,null,null,null,null,null,null,null,null,null,null,null,null,null,null,null,469]
[null,null,null,null,null,null,null,null,null,null,null,null,null,null,null,null,null,null,null,null,null,null,null,null,null,null,null,null,null,null,null,null,null,null,null,470]
[null,null,null,null,null,null,null,null,null,null,null,null,null,null,null,null,null,null,null,null,null,null,null,null,null,null,null,null,null,null,null,null,null,null,null,471]
[null,null,null,null,null,null,null,null,null,null,null,null,null,null,null,null,null,null,null,null,null,null,null,null,null,null,null,null,null,null,null,null,null,null,null,472]
[null,null,null,null,null,null,null,null,null,null,null,null,null,null,null,null,null,null,null,null,null,null,null,null,null,null,null,null,null,null,null,null,null,null,null,473]
[null,null,null,null,null,null,null,null,null,null,null,null,null,null,null,null,null,null,null,null,null,null,null,null,null,null,null,null,null,null,null,null,null,null,null,474]
[null,null,null,null,null,null,null,null,null,null,null,null,null,null,null,null,null,null,null,null,null,null,null,null,null,null,null,null,null,null,null,null,null,null,null,475]
[null,null,null,null,null,null,null,null,null,null,null,null,null,null,null,null,null,null,null,null,null,null,null,null,null,null,null,null,null,null,null,null,null,null,null,476]
[null,null,null,null,null,null,null,null,null,null,null,null,null,null,null,null,null,null,null,null,null,null,null,null,null,null,null,null,null,null,null,null,null,null,null,477]
[null,null,null,null,null,null,null,null,null,null,null,null,null,null,null,null,null,null,null,null,null,null,null,null,null,null,null,null,null,null,null,null,null,null,null,478]
[null,null,null,null,null,null,null,null,null,null,null,null,null,null,null,null,null,null,null,null,null,null,null,null,null,null,null,null,null,null,null,null,null,null,null,479]
[null,null,null,null,null,null,null,null,null,null,null,null,null,null,null,null,null,null,null,null,null,null,null,null,null,null,null,null,null,null,null,null,null,null,null,480]
[null,null,null,null,null,null,null,null,null,null,null,null,null,null,null,null,null,null,null,null,null,null,null,null,null,null,null,null,null,null,null,null,null,null,null,481]
[null,null,null,null,null,null,null,null,null,null,null,null,null,null,null,null,null,null,null,null,null,null,null,null,null,null,null,null,null,null,null,null,null,null,null,482]
[null,null,null,null,null,null,null,null,null,null,null,null,null,null,null,null,null,null,null,null,null,null,null,null,null,null,null,null,null,null,null,null,null,null,null,483]
[null,null,null,null,null,null,null,null,null,null,null,null,null,null,null,null,null,null,null,null,null,null,null,null,null,null,null,null,null,null,null,null,null,null,null,484]
[null,null,null,null,null,null,null,null,null,null,null,null,null,null,null,null,null,null,null,null,null,null,null,null,null,null,null,null,null,null,null,null,null,null,null,485]
[null,null,null,null,null,null,null,null,null,null,null,null,null,null,null,null,null,null,null,null,null,null,null,null,null,null,null,null,null,null,null,null,null,null,null,486]
[null,null,null,null,null,null,null,null,null,null,null,null,null,null,null,null,null,null,null,null,null,null,null,null,null,null,null,null,null,null,null,null,null,null,null,487]
[null,null,null,null,null,null,null,null,null,null,null,null,null,null,null,null,null,null,null,null,null,null,null,null,null,null,null,null,null,null,null,null,null,null,null,488]
[null,null,null,null,null,null,null,null,null,null,null,null,null,null,null,null,null,null,null,null,null,null,null,null,null,null,null,null,null,null,null,null,null,null,null,489]
[null,null,null,null,null,null,null,null,null,null,null,null,null,null,null,null,null,null,null,null,null,null,null,null,null,null,null,null,null,null,null,null,null,null,null,490]
[null,null,null,null,null,null,null,null,null,null,null,null,null,null,null,null,null,null,null,null,null,null,null,null,null,null,null,null,null,null,null,null,null,null,null,491]
[null,null,null,null,null,null,null,null,null,null,null,null,null,null,null,null,null,null,null,null,null,null,null,null,null,null,null,null,null,null,null,null,null,null,null,492]
[null,null,null,null,null,null,null,null,null,null,null,null,null,null,null,null,null,null,null,null,null,null,null,null,null,null,null,null,null,null,null,null,null,null,null,493]
[null,null,null,null,null,null,null,null,null,null,null,null,null,null,null,null,null,null,null,null,null,null,null,null,null,null,null,null,null,null,null,null,null,null,null,494]
[null,null,null,null,null,null,null,null,null,null,null,null,null,null,null,null,null,null,null,null,null,null,null,null,null,null,null,null,null,null,null,null,null,null,null,495]
[null,null,null,null,null,null,null,null,null,null,null,null,null,null,null,null,null,null,null,null,null,null,null,null,null,null,null,null,null,null,null,null,null,null,null,496]
[null,null,null,null,null,null,null,null,null,null,null,null,null,null,null,null,null,null,null,null,null,null,null,null,null,null,null,null,null,null,null,null,null,null,null,497]
[null,null,null,null,null,null,null,null,null,null,null,null,null,null,null,null,null,null,null,null,null,null,null,null,null,null,null,null,null,null,null,null,null,null,null,498]
[null,null,null,null,null,null,null,null,null,null,null,null,null,null,null,null,null,null,null,null,null,null,null,null,null,null,null,null,null,null,null,null,null,null,null,499]
[null,null,null,null,null,null,null,null,null,null,null,null,null,null,null,null,null,null,null,null,null,null,null,null,null,null,null,null,null,null,null,null,null,null,null,500]
[null,null,null,null,null,null,null,null,null,null,null,null,null,null,null,null,null,null,null,null,null,null,null,null,null,null,null,null,null,null,null,null,null,null,null,501]
[null,null,null,null,null,null,null,null,null,null,null,null,null,null,null,null,null,null,null,null,null,null,null,null,null,null,null,null,null,null,null,null,null,null,null,502]
[null,null,null,null,null,null,null,null,null,null,null,null,null,null,null,null,null,null,null,null,null,null,null,null,null,null,null,null,null,null,null,null,null,null,null,503]
[null,null,null,null,null,null,null,null,null,null,null,null,null,null,null,null,null,null,null,null,null,null,null,null,null,null,null,null,null,null,null,null,null,null,null,504]
[null,null,null,null,null,null,null,null,null,null,null,null,null,null,null,null,null,null,null,null,null,null,null,null,null,null,null,null,null,null,null,null,null,null,null,505]
[null,null,null,null,null,null,null,null,null,null,null,null,null,null,null,null,null,null,null,null,null,null,null,null,null,null,null,null,null,null,null,null,null,null,null,506]
[null,null,null,null,null,null,null,null,null,null,null,null,null,null,null,null,null,null,null,null,null,null,null,null,null,null,null,null,null,null,null,null,null,null,null,507]
[null,null,null,null,null,null,null,null,null,null,null,null,null,null,null,null,null,null,null,null,null,null,null,null,null,null,null,null,null,null,null,null,null,null,null,508]
[null,null,null,null,null,null,null,null,null,null,null,null,null,null,null,null,null,null,null,null,null,null,null,null,null,null,null,null,null,null,null,null,null,null,null,509]
[null,null,null,null,null,null,null,null,null,null,null,null,null,null,null,null,null,null,null,null,null,null,null,null,null,null,null,null,null,null,null,null,null,null,null,510]
[null,null,null,null,null,null,null,null,null,null,null,null,null,null,null,null,null,null,null,null,null,null,null,null,null,null,null,null,null,null,null,null,null,null,null,511]
[null,null,null,null,null,null,null,null,null,null,null,null,null,null,null,null,null,null,null,null,null,null,null,null,null,null,null,null,null,null,null,null,null,null,null,512]
[null,null,null,null,null,null,null,null,null,null,null,null,null,null,null,null,null,null,null,null,null,null,null,null,null,null,null,null,null,null,null,null,null,null,null,513]
[null,null,null,null,null,null,null,null,null,null,null,null,null,null,null,null,null,null,null,null,null,null,null,null,null,null,null,null,null,null,null,null,null,null,null,514]
[null,null,null,null,null,null,null,null,null,null,null,null,null,null,null,null,null,null,null,null,null,null,null,null,null,null,null,null,null,null,null,null,null,null,null,515]
[null,null,null,null,null,null,null,null,null,null,null,null,null,null,null,null,null,null,null,null,null,null,null,null,null,null,null,null,null,null,null,null,null,null,null,516]
[null,null,null,null,null,null,null,null,null,null,null,null,null,null,null,null,null,null,null,null,null,null,null,null,null,null,null,null,null,null,null,null,null,null,null,517]
[null,null,null,null,null,null,null,null,null,null,null,null,null,null,null,null,null,null,null,null,null,null,null,null,null,null,null,null,null,null,null,null,null,null,null,518]
[null,null,null,null,null,null,null,null,null,null,null,null,null,null,null,null,null,null,null,null,null,null,null,null,null,null,null,null,null,null,null,null,null,null,null,519]
[null,null,null,null,null,null,null,null,null,null,null,null,null,null,null,null,null,null,null,null,null,null,null,null,null,null,null,null,null,null,null,null,null,null,null,520]
[null,null,null,null,null,null,null,null,null,null,null,null,null,null,null,null,null,null,null,null,null,null,null,null,null,null,null,null,null,null,null,null,null,null,null,521]
[null,null,null,null,null,null,null,null,null,null,null,null,null,null,null,null,null,null,null,null,null,null,null,null,null,null,null,null,null,null,null,null,null,null,null,522]
[null,null,null,null,null,null,null,null,null,null,null,null,null,null,null,null,null,null,null,null,null,null,null,null,null,null,null,null,null,null,null,null,null,null,null,523]
[null,null,null,null,null,null,null,null,null,null,null,null,null,null,null,null,null,null,null,null,null,null,null,null,null,null,null,null,null,null,null,null,null,null,null,524]
[null,null,null,null,null,null,null,null,null,null,null,null,null,null,null,null,null,null,null,null,null,null,null,null,null,null,null,null,null,null,null,null,null,null,null,525]
[null,null,null,null,null,null,null,null,null,null,null,null,null,null,null,null,null,null,null,null,null,null,null,null,null,null,null,null,null,null,null,null,null,null,null,526]
[null,null,null,null,null,null,null,null,null,null,null,null,null,null,null,null,null,null,null,null,null,null,null,null,null,null,null,null,null,null,null,null,null,null,null,527]
[null,null,null,null,null,null,null,null,null,null,null,null,null,null,null,null,null,null,null,null,null,null,null,null,null,null,null,null,null,null,null,null,null,null,null,528]
[null,null,null,null,null,null,null,null,null,null,null,null,null,null,null,null,null,null,null,null,null,null,null,null,null,null,null,null,null,null,null,null,null,null,null,529]
[null,null,null,null,null,null,null,null,null,null,null,null,null,null,null,null,null,null,null,null,null,null,null,null,null,null,null,null,null,null,null,null,null,null,null,530]
[null,null,null,null,null,null,null,null,null,null,null,null,null,null,null,null,null,null,null,null,null,null,null,null,null,null,null,null,null,null,null,null,null,null,null,531]
[null,null,null,null,null,null,null,null,null,null,null,null,null,null,null,null,null,null,null,null,null,null,null,null,null,null,null,null,null,null,null,null,null,null,null,532]
[null,null,null,null,null,null,null,null,null,null,null,null,null,null,null,null,null,null,null,null,null,null,null,null,null,null,null,null,null,null,null,null,null,null,null,533]
[null,null,null,null,null,null,null,null,null,null,null,null,null,null,null,null,null,null,null,null,null,null,null,null,null,null,null,null,null,null,null,null,null,null,null,534]
[null,null,null,null,null,null,null,null,null,null,null,null,null,null,null,null,null,null,null,null,null,null,null,null,null,null,null,null,null,null,null,null,null,null,null,535]
[null,null,null,null,null,null,null,null,null,null,null,null,null,null,null,null,null,null,null,null,null,null,null,null,null,null,null,null,null,null,null,null,null,null,null,536]
[null,null,null,null,null,null,null,null,null,null,null,null,null,null,null,null,null,null,null,null,null,null,null,null,null,null,null,null,null,null,null,null,null,null,null,537]
[null,null,null,null,null,null,null,null,null,null,null,null,null,null,null,null,null,null,null,null,null,null,null,null,null,null,null,null,null,null,null,null,null,null,null,538]
[null,null,null,null,null,null,null,null,null,null,null,null,null,null,null,null,null,null,null,null,null,null,null,null,null,null,null,null,null,null,null,null,null,null,null,539]
[null,null,null,null,null,null,null,null,null,null,null,null,null,null,null,null,null,null,null,null,null,null,null,null,null,null,null,null,null,null,null,null,null,null,null,540]
[null,null,null,null,null,null,null,null,null,null,null,null,null,null,null,null,null,null,null,null,null,null,null,null,null,null,null,null,null,null,null,null,null,null,null,541]
[null,null,null,null,null,null,null,null,null,null,null,null,null,null,null,null,null,null,null,null,null,null,null,null,null,null,null,null,null,null,null,null,null,null,null,542]
[null,null,null,null,null,null,null,null,null,null,null,null,null,null,null,null,null,null,null,null,null,null,null,null,null,null,null,null,null,null,null,null,null,null,null,543]
[null,null,null,null,null,null,null,null,null,null,null,null,null,null,null,null,null,null,null,null,null,null,null,null,null,null,null,null,null,null,null,null,null,null,null,544]
[null,null,null,null,null,null,null,null,null,null,null,null,null,null,null,null,null,null,null,null,null,null,null,null,null,null,null,null,null,null,null,null,null,null,null,545]
[null,null,null,null,null,null,null,null,null,null,null,null,null,null,null,null,null,null,null,null,null,null,null,null,null,null,null,null,null,null,null,null,null,null,null,546]
[null,null,null,null,null,null,null,null,null,null,null,null,null,null,null,null,null,null,null,null,null,null,null,null,null,null,null,null,null,null,null,null,null,null,null,547]
[null,null,null,null,null,null,null,null,null,null,null,null,null,null,null,null,null,null,null,null,null,null,null,null,null,null,null,null,null,null,null,null,null,null,null,548]
[null,null,null,null,null,null,null,null,null,null,null,null,null,null,null,null,null,null,null,null,null,null,null,null,null,null,null,null,null,null,null,null,null,null,null,549]
[null,null,null,null,null,null,null,null,null,null,null,null,null,null,null,null,null,null,null,null,null,null,null,null,null,null,null,null,null,null,null,null,null,null,null,550]
[null,null,null,null,null,null,null,null,null,null,null,null,null,null,null,null,null,null,null,null,null,null,null,null,null,null,null,null,null,null,null,null,null,null,null,551]
[null,null,null,null,null,null,null,null,null,null,null,null,null,null,null,null,null,null,null,null,null,null,null,null,null,null,null,null,null,null,null,null,null,null,null,552]
[null,null,null,null,null,null,null,null,null,null,null,null,null,null,null,null,null,null,null,null,null,null,null,null,null,null,null,null,null,null,null,null,null,null,null,553]
[null,null,null,null,null,null,null,null,null,null,null,null,null,null,null,null,null,null,null,null,null,null,null,null,null,null,null,null,null,null,null,null,null,null,null,554]
[null,null,null,null,null,null,null,null,null,null,null,null,null,null,null,null,null,null,null,null,null,null,null,null,null,null,null,null,null,null,null,null,null,null,null,555]
[null,null,null,null,null,null,null,null,null,null,null,null,null,null,null,null,null,null,null,null,null,null,null,null,null,null,null,null,null,null,null,null,null,null,null,556]
[null,null,null,null,null,null,null,null,null,null,null,null,null,null,null,null,null,null,null,null,null,null,null,null,null,null,null,null,null,null,null,null,null,null,null,557]
[null,null,null,null,null,null,null,null,null,null,null,null,null,null,null,null,null,null,null,null,null,null,null,null,null,null,null,null,null,null,null,null,null,null,null,558]
[null,null,null,null,null,null,null,null,null,null,null,null,null,null,null,null,null,null,null,null,null,null,null,null,null,null,null,null,null,null,null,null,null,null,null,559]
[null,null,null,null,null,null,null,null,null,null,null,null,null,null,null,null,null,null,null,null,null,null,null,null,null,null,null,null,null,null,null,null,null,null,null,560]
[null,null,null,null,null,null,null,null,null,null,null,null,null,null,null,null,null,null,null,null,null,null,null,null,null,null,null,null,null,null,null,null,null,null,null,561]
[null,null,null,null,null,null,null,null,null,null,null,null,null,null,null,null,null,null,null,null,null,null,null,null,null,null,null,null,null,null,null,null,null,null,null,562]
[null,null,null,null,null,null,null,null,null,null,null,null,null,null,null,null,null,null,null,null,null,null,null,null,null,null,null,null,null,null,null,null,null,null,null,563]
[null,null,null,null,null,null,null,null,null,null,null,null,null,null,null,null,null,null,null,null,null,null,null,null,null,null,null,null,null,null,null,null,null,null,null,564]
[null,null,null,null,null,null,null,null,null,null,null,null,null,null,null,null,null,null,null,null,null,null,null,null,null,null,null,null,null,null,null,null,null,null,null,565]
[null,null,null,null,null,null,null,null,null,null,null,null,null,null,null,null,null,null,null,null,null,null,null,null,null,null,null,null,null,null,null,null,null,null,null,566]
[null,null,null,null,null,null,null,null,null,null,null,null,null,null,null,null,null,null,null,null,null,null,null,null,null,null,null,null,null,null,null,null,null,null,null,567]
[null,null,null,null,null,null,null,null,null,null,null,null,null,null,null,null,null,null,null,null,null,null,null,null,null,null,null,null,null,null,null,null,null,null,null,568]
[null,null,null,null,null,null,null,null,null,null,null,null,null,null,null,null,null,null,null,null,null,null,null,null,null,null,null,null,null,null,null,null,null,null,null,569]
[null,null,null,null,null,null,null,null,null,null,null,null,null,null,null,null,null,null,null,null,null,null,null,null,null,null,null,null,null,null,null,null,null,null,null,570]
[null,null,null,null,null,null,null,null,null,null,null,null,null,null,null,null,null,null,null,null,null,null,null,null,null,null,null,null,null,null,null,null,null,null,null,571]
[null,null,null,null,null,null,null,null,null,null,null,null,null,null,null,null,null,null,null,null,null,null,null,null,null,null,null,null,null,null,null,null,null,null,null,572]
[null,null,null,null,null,null,null,null,null,null,null,null,null,null,null,null,null,null,null,null,null,null,null,null,null,null,null,null,null,null,null,null,null,null,null,573]
[null,null,null,null,null,null,null,null,null,null,null,null,null,null,null,null,null,null,null,null,null,null,null,null,null,null,null,null,null,null,null,null,null,null,null,574]
[null,null,null,null,null,null,null,null,null,null,null,null,null,null,null,null,null,null,null,null,null,null,null,null,null,null,null,null,null,null,null,null,null,null,null,575]
[null,null,null,null,null,null,null,null,null,null,null,null,null,null,null,null,null,null,null,null,null,null,null,null,null,null,null,null,null,null,null,null,null,null,null,576]
[null,null,null,null,null,null,null,null,null,null,null,null,null,null,null,null,null,null,null,null,null,null,null,null,null,null,null,null,null,null,null,null,null,null,null,577]
[null,null,null,null,null,null,null,null,null,null,null,null,null,null,null,null,null,null,null,null,null,null,null,null,null,null,null,null,null,null,null,null,null,null,null,578]
[null,null,null,null,null,null,null,null,null,null,null,null,null,null,null,null,null,null,null,null,null,null,null,null,null,null,null,null,null,null,null,null,null,null,null,579]
[null,null,null,null,null,null,null,null,null,null,null,null,null,null,null,null,null,null,null,null,null,null,null,null,null,null,null,null,null,null,null,null,null,null,null,580]
[null,null,null,null,null,null,null,null,null,null,null,null,null,null,null,null,null,null,null,null,null,null,null,null,null,null,null,null,null,null,null,null,null,null,null,581]
[null,null,null,null,null,null,null,null,null,null,null,null,null,null,null,null,null,null,null,null,null,null,null,null,null,null,null,null,null,null,null,null,null,null,null,582]
[null,null,null,null,null,null,null,null,null,null,null,null,null,null,null,null,null,null,null,null,null,null,null,null,null,null,null,null,null,null,null,null,null,null,null,583]
[null,null,null,null,null,null,null,null,null,null,null,null,null,null,null,null,null,null,null,null,null,null,null,null,null,null,null,null,null,null,null,null,null,null,null,584]
[null,null,null,null,null,null,null,null,null,null,null,null,null,null,null,null,null,null,null,null,null,null,null,null,null,null,null,null,null,null,null,null,null,null,null,585]
[null,null,null,null,null,null,null,null,null,null,null,null,null,null,null,null,null,null,null,null,null,null,null,null,null,null,null,null,null,null,null,null,null,null,null,586]
[null,null,null,null,null,null,null,null,null,null,null,null,null,null,null,null,null,null,null,null,null,null,null,null,null,null,null,null,null,null,null,null,null,null,null,587]
[null,null,null,null,null,null,null,null,null,null,null,null,null,null,null,null,null,null,null,null,null,null,null,null,null,null,null,null,null,null,null,null,null,null,null,588]
[null,null,null,null,null,null,null,null,null,null,null,null,null,null,null,null,null,null,null,null,null,null,null,null,null,null,null,null,null,null,null,null,null,null,null,589]
[null,null,null,null,null,null,null,null,null,null,null,null,null,null,null,null,null,null,null,null,null,null,null,null,null,null,null,null,null,null,null,null,null,null,null,590]
[null,null,null,null,null,null,null,null,null,null,null,null,null,null,null,null,null,null,null,null,null,null,null,null,null,null,null,null,null,null,null,null,null,null,null,591]
[null,null,null,null,null,null,null,null,null,null,null,null,null,null,null,null,null,null,null,null,null,null,null,null,null,null,null,null,null,null,null,null,null,null,null,592]
[null,null,null,null,null,null,null,null,null,null,null,null,null,null,null,null,null,null,null,null,null,null,null,null,null,null,null,null,null,null,null,null,null,null,null,593]
[null,null,null,null,null,null,null,null,null,null,null,null,null,null,null,null,null,null,null,null,null,null,null,null,null,null,null,null,null,null,null,null,null,null,null,594]
[null,null,null,null,null,null,null,null,null,null,null,null,null,null,null,null,null,null,null,null,null,null,null,null,null,null,null,null,null,null,null,null,null,null,null,595]
[null,null,null,null,null,null,null,null,null,null,null,null,null,null,null,null,null,null,null,null,null,null,null,null,null,null,null,null,null,null,null,null,null,null,null,596]
[null,null,null,null,null,null,null,null,null,null,null,null,null,null,null,null,null,null,null,null,null,null,null,null,null,null,null,null,null,null,null,null,null,null,null,597]
[null,null,null,null,null,null,null,null,null,null,null,null,null,null,null,null,null,null,null,null,null,null,null,null,null,null,null,null,null,null,null,null,null,null,null,598]
[null,null,null,null,null,null,null,null,null,null,null,null,null,null,null,null,null,null,null,null,null,null,null,null,null,null,null,null,null,null,null,null,null,null,null,599]
[null,null,null,null,null,null,null,null,null,null,null,null,null,null,null,null,null,null,null,null,null,null,null,null,null,null,null,null,null,null,null,null,null,null,null,600]
[null,null,null,null,null,null,null,null,null,null,null,null,null,null,null,null,null,null,null,null,null,null,null,null,null,null,null,null,null,null,null,null,null,null,null,601]
[null,null,null,null,null,null,null,null,null,null,null,null,null,null,null,null,null,null,null,null,null,null,null,null,null,null,null,null,null,null,null,null,null,null,null,602]
[null,null,null,null,null,null,null,null,null,null,null,null,null,null,null,null,null,null,null,null,null,null,null,null,null,null,null,null,null,null,null,null,null,null,null,603]
[null,null,null,null,null,null,null,null,null,null,null,null,null,null,null,null,null,null,null,null,null,null,null,null,null,null,null,null,null,null,null,null,null,null,null,604]
[null,null,null,null,null,null,null,null,null,null,null,null,null,null,null,null,null,null,null,null,null,null,null,null,null,null,null,null,null,null,null,null,null,null,null,605]
[null,null,null,null,null,null,null,null,null,null,null,null,null,null,null,null,null,null,null,null,null,null,null,null,null,null,null,null,null,null,null,null,null,null,null,606]
[null,null,null,null,null,null,null,null,null,null,null,null,null,null,null,null,null,null,null,null,null,null,null,null,null,null,null,null,null,null,null,null,null,null,null,607]
[null,null,null,null,null,null,null,null,null,null,null,null,null,null,null,null,null,null,null,null,null,null,null,null,null,null,null,null,null,null,null,null,null,null,null,608]
[null,null,null,null,null,null,null,null,null,null,null,null,null,null,null,null,null,null,null,null,null,null,null,null,null,null,null,null,null,null,null,null,null,null,null,609]
[null,null,null,null,null,null,null,null,null,null,null,null,null,null,null,null,null,null,null,null,null,null,null,null,null,null,null,null,null,null,null,null,null,null,null,610]
[null,null,null,null,null,null,null,null,null,null,null,null,null,null,null,null,null,null,null,null,null,null,null,null,null,null,null,null,null,null,null,null,null,null,null,611]
[null,null,null,null,null,null,null,null,null,null,null,null,null,null,null,null,null,null,null,null,null,null,null,null,null,null,null,null,null,null,null,null,null,null,null,612]
[null,null,null,null,null,null,null,null,null,null,null,null,null,null,null,null,null,null,null,null,null,null,null,null,null,null,null,null,null,null,null,null,null,null,null,613]
[null,null,null,null,null,null,null,null,null,null,null,null,null,null,null,null,null,null,null,null,null,null,null,null,null,null,null,null,null,null,null,null,null,null,null,614]
[null,null,null,null,null,null,null,null,null,null,null,null,null,null,null,null,null,null,null,null,null,null,null,null,null,null,null,null,null,null,null,null,null,null,null,615]
[null,null,null,null,null,null,null,null,null,null,null,null,null,null,null,null,null,null,null,null,null,null,null,null,null,null,null,null,null,null,null,null,null,null,null,616]
[null,null,null,null,null,null,null,null,null,null,null,null,null,null,null,null,null,null,null,null,null,null,null,null,null,null,null,null,null,null,null,null,null,null,null,617]
[null,null,null,null,null,null,null,null,null,null,null,null,null,null,null,null,null,null,null,null,null,null,null,null,null,null,null,null,null,null,null,null,null,null,null,618]
[null,null,null,null,null,null,null,null,null,null,null,null,null,null,null,null,null,null,null,null,null,null,null,null,null,null,null,null,null,null,null,null,null,null,null,619]
[null,null,null,null,null,null,null,null,null,null,null,null,null,null,null,null,null,null,null,null,null,null,null,null,null,null,null,null,null,null,null,null,null,null,null,620]
[null,null,null,null,null,null,null,null,null,null,null,null,null,null,null,null,null,null,null,null,null,null,null,null,null,null,null,null,null,null,null,null,null,null,null,621]
[null,null,null,null,null,null,null,null,null,null,null,null,null,null,null,null,null,null,null,null,null,null,null,null,null,null,null,null,null,null,null,null,null,null,null,622]
[null,null,null,null,null,null,null,null,null,null,null,null,null,null,null,null,null,null,null,null,null,null,null,null,null,null,null,null,null,null,null,null,null,null,null,623]
[null,null,null,null,null,null,null,null,null,null,null,null,null,null,null,null,null,null,null,null,null,null,null,null,null,null,null,null,null,null,null,null,null,null,null,624]
[null,null,null,null,null,null,null,null,null,null,null,null,null,null,null,null,null,null,null,null,null,null,null,null,null,null,null,null,null,null,null,null,null,null,null,625]
[null,null,null,null,null,null,null,null,null,null,null,null,null,null,null,null,null,null,null,null,null,null,null,null,null,null,null,null,null,null,null,null,null,null,null,626]
[null,null,null,null,null,null,null,null,null,null,null,null,null,null,null,null,null,null,null,null,null,null,null,null,null,null,null,null,null,null,null,null,null,null,null,627]
[null,null,null,null,null,null,null,null,null,null,null,null,null,null,null,null,null,null,null,null,null,null,null,null,null,null,null,null,null,null,null,null,null,null,null,628]
[null,null,null,null,null,null,null,null,null,null,null,null,null,null,null,null,null,null,null,null,null,null,null,null,null,null,null,null,null,null,null,null,null,null,null,629]
[null,null,null,null,null,null,null,null,null,null,null,null,null,null,null,null,null,null,null,null,null,null,null,null,null,null,null,null,null,null,null,null,null,null,null,630]
[null,null,null,null,null,null,null,null,null,null,null,null,null,null,null,null,null,null,null,null,null,null,null,null,null,null,null,null,null,null,null,null,null,null,null,631]
[null,null,null,null,null,null,null,null,null,null,null,null,null,null,null,null,null,null,null,null,null,null,null,null,null,null,null,null,null,null,null,null,null,null,null,632]
[null,null,null,null,null,null,null,null,null,null,null,null,null,null,null,null,null,null,null,null,null,null,null,null,null,null,null,null,null,null,null,null,null,null,null,633]
[null,null,null,null,null,null,null,null,null,null,null,null,null,null,null,null,null,null,null,null,null,null,null,null,null,null,null,null,null,null,null,null,null,null,null,634]
[null,null,null,null,null,null,null,null,null,null,null,null,null,null,null,null,null,null,null,null,null,null,null,null,null,null,null,null,null,null,null,null,null,null,null,635]
[null,null,null,null,null,null,null,null,null,null,null,null,null,null,null,null,null,null,null,null,null,null,null,null,null,null,null,null,null,null,null,null,null,null,null,636]
[null,null,null,null,null,null,null,null,null,null,null,null,null,null,null,null,null,null,null,null,null,null,null,null,null,null,null,null,null,null,null,null,null,null,null,637]
[null,null,null,null,null,null,null,null,null,null,null,null,null,null,null,null,null,null,null,null,null,null,null,null,null,null,null,null,null,null,null,null,null,null,null,638]
[null,null,null,null,null,null,null,null,null,null,null,null,null,null,null,null,null,null,null,null,null,null,null,null,null,null,null,null,null,null,null,null,null,null,null,639]
[null,null,null,null,null,null,null,null,null,null,null,null,null,null,null,null,null,null,null,null,null,null,null,null,null,null,null,null,null,null,null,null,null,null,null,640]
[null,null,null,null,null,null,null,null,null,null,null,null,null,null,null,null,null,null,null,null,null,null,null,null,null,null,null,null,null,null,null,null,null,null,null,641]
[null,null,null,null,null,null,null,null,null,null,null,null,null,null,null,null,null,null,null,null,null,null,null,null,null,null,null,null,null,null,null,null,null,null,null,642]
[null,null,null,null,null,null,null,null,null,null,null,null,null,null,null,null,null,null,null,null,null,null,null,null,null,null,null,null,null,null,null,null,null,null,null,643]
[null,null,null,null,null,null,null,null,null,null,null,null,null,null,null,null,null,null,null,null,null,null,null,null,null,null,null,null,null,null,null,null,null,null,null,644]
[null,null,null,null,null,null,null,null,null,null,null,null,null,null,null,null,null,null,null,null,null,null,null,null,null,null,null,null,null,null,null,null,null,null,null,645]
[null,null,null,null,null,null,null,null,null,null,null,null,null,null,null,null,null,null,null,null,null,null,null,null,null,null,null,null,null,null,null,null,null,null,null,646]
[null,null,null,null,null,null,null,null,null,null,null,null,null,null,null,null,null,null,null,null,null,null,null,null,null,null,null,null,null,null,null,null,null,null,null,647]
[null,null,null,null,null,null,null,null,null,null,null,null,null,null,null,null,null,null,null,null,null,null,null,null,null,null,null,null,null,null,null,null,null,null,null,648]
[null,null,null,null,null,null,null,null,null,null,null,null,null,null,null,null,null,null,null,null,null,null,null,null,null,null,null,null,null,null,null,null,null,null,null,649]
[null,null,null,null,null,null,null,null,null,null,null,null,null,null,null,null,null,null,null,null,null,null,null,null,null,null,null,null,null,null,null,null,null,null,null,650]
[null,null,null,null,null,null,null,null,null,null,null,null,null,null,null,null,null,null,null,null,null,null,null,null,null,null,null,null,null,null,null,null,null,null,null,651]
[null,null,null,null,null,null,null,null,null,null,null,null,null,null,null,null,null,null,null,null,null,null,null,null,null,null,null,null,null,null,null,null,null,null,null,652]
[null,null,null,null,null,null,null,null,null,null,null,null,null,null,null,null,null,null,null,null,null,null,null,null,null,null,null,null,null,null,null,null,null,null,null,653]
[null,null,null,null,null,null,null,null,null,null,null,null,null,null,null,null,null,null,null,null,null,null,null,null,null,null,null,null,null,null,null,null,null,null,null,654]
[null,null,null,null,null,null,null,null,null,null,null,null,null,null,null,null,null,null,null,null,null,null,null,null,null,null,null,null,null,null,null,null,null,null,null,655]
[null,null,null,null,null,null,null,null,null,null,null,null,null,null,null,null,null,null,null,null,null,null,null,null,null,null,null,null,null,null,null,null,null,null,null,656]
[null,null,null,null,null,null,null,null,null,null,null,null,null,null,null,null,null,null,null,null,null,null,null,null,null,null,null,null,null,null,null,null,null,null,null,657]
[null,null,null,null,null,null,null,null,null,null,null,null,null,null,null,null,null,null,null,null,null,null,null,null,null,null,null,null,null,null,null,null,null,null,null,658]
[null,null,null,null,null,null,null,null,null,null,null,null,null,null,null,null,null,null,null,null,null,null,null,null,null,null,null,null,null,null,null,null,null,null,null,659]
[null,null,null,null,null,null,null,null,null,null,null,null,null,null,null,null,null,null,null,null,null,null,null,null,null,null,null,null,null,null,null,null,null,null,null,660]
[null,null,null,null,null,null,null,null,null,null,null,null,null,null,null,null,null,null,null,null,null,null,null,null,null,null,null,null,null,null,null,null,null,null,null,661]
[null,null,null,null,null,null,null,null,null,null,null,null,null,null,null,null,null,null,null,null,null,null,null,null,null,null,null,null,null,null,null,null,null,null,null,662]
[null,null,null,null,null,null,null,null,null,null,null,null,null,null,null,null,null,null,null,null,null,null,null,null,null,null,null,null,null,null,null,null,null,null,null,663]
[null,null,null,null,null,null,null,null,null,null,null,null,null,null,null,null,null,null,null,null,null,null,null,null,null,null,null,null,null,null,null,null,null,null,null,664]
[null,null,null,null,null,null,null,null,null,null,null,null,null,null,null,null,null,null,null,null,null,null,null,null,null,null,null,null,null,null,null,null,null,null,null,665]
[null,null,null,null,null,null,null,null,null,null,null,null,null,null,null,null,null,null,null,null,null,null,null,null,null,null,null,null,null,null,null,null,null,null,null,666]
[null,null,null,null,null,null,null,null,null,null,null,null,null,null,null,null,null,null,null,null,null,null,null,null,null,null,null,null,null,null,null,null,null,null,null,667]
[null,null,null,null,null,null,null,null,null,null,null,null,null,null,null,null,null,null,null,null,null,null,null,null,null,null,null,null,null,null,null,null,null,null,null,668]
[null,null,null,null,null,null,null,null,null,null,null,null,null,null,null,null,null,null,null,null,null,null,null,null,null,null,null,null,null,null,null,null,null,null,null,669]
[null,null,null,null,null,null,null,null,null,null,null,null,null,null,null,null,null,null,null,null,null,null,null,null,null,null,null,null,null,null,null,null,null,null,null,670]
[null,null,null,null,null,null,null,null,null,null,null,null,null,null,null,null,null,null,null,null,null,null,null,null,null,null,null,null,null,null,null,null,null,null,null,671]
[null,null,null,null,null,null,null,null,null,null,null,null,null,null,null,null,null,null,null,null,null,null,null,null,null,null,null,null,null,null,null,null,null,null,null,672]
[null,null,null,null,null,null,null,null,null,null,null,null,null,null,null,null,null,null,null,null,null,null,null,null,null,null,null,null,null,null,null,null,null,null,null,673]
[null,null,null,null,null,null,null,null,null,null,null,null,null,null,null,null,null,null,null,null,null,null,null,null,null,null,null,null,null,null,null,null,null,null,null,674]
[null,null,null,null,null,null,null,null,null,null,null,null,null,null,null,null,null,null,null,null,null,null,null,null,null,null,null,null,null,null,null,null,null,null,null,675]
[null,null,null,null,null,null,null,null,null,null,null,null,null,null,null,null,null,null,null,null,null,null,null,null,null,null,null,null,null,null,null,null,null,null,null,676]
[null,null,null,null,null,null,null,null,null,null,null,null,null,null,null,null,null,null,null,null,null,null,null,null,null,null,null,null,null,null,null,null,null,null,null,677]
[null,null,null,null,null,null,null,null,null,null,null,null,null,null,null,null,null,null,null,null,null,null,null,null,null,null,null,null,null,null,null,null,null,null,null,678]
[null,null,null,null,null,null,null,null,null,null,null,null,null,null,null,null,null,null,null,null,null,null,null,null,null,null,null,null,null,null,null,null,null,null,null,679]
[null,null,null,null,null,null,null,null,null,null,null,null,null,null,null,null,null,null,null,null,null,null,null,null,null,null,null,null,null,null,null,null,null,null,null,680]
[null,null,null,null,null,null,null,null,null,null,null,null,null,null,null,null,null,null,null,null,null,null,null,null,null,null,null,null,null,null,null,null,null,null,null,681]
[null,null,null,null,null,null,null,null,null,null,null,null,null,null,null,null,null,null,null,null,null,null,null,null,null,null,null,null,null,null,null,null,null,null,null,682]
[null,null,null,null,null,null,null,null,null,null,null,null,null,null,null,null,null,null,null,null,null,null,null,null,null,null,null,null,null,null,null,null,null,null,null,683]
[null,null,null,null,null,null,null,null,null,null,null,null,null,null,null,null,null,null,null,null,null,null,null,null,null,null,null,null,null,null,null,null,null,null,null,684]
[null,null,null,null,null,null,null,null,null,null,null,null,null,null,null,null,null,null,null,null,null,null,null,null,null,null,null,null,null,null,null,null,null,null,null,685]
[null,null,null,null,null,null,null,null,null,null,null,null,null,null,null,null,null,null,null,null,null,null,null,null,null,null,null,null,null,null,null,null,null,null,null,686]
[null,null,null,null,null,null,null,null,null,null,null,null,null,null,null,null,null,null,null,null,null,null,null,null,null,null,null,null,null,null,null,null,null,null,null,687]
[null,null,null,null,null,null,null,null,null,null,null,null,null,null,null,null,null,null,null,null,null,null,null,null,null,null,null,null,null,null,null,null,null,null,null,688]
[null,null,null,null,null,null,null,null,null,null,null,null,null,null,null,null,null,null,null,null,null,null,null,null,null,null,null,null,null,null,null,null,null,null,null,689]
[null,null,null,null,null,null,null,null,null,null,null,null,null,null,null,null,null,null,null,null,null,null,null,null,null,null,null,null,null,null,null,null,null,null,null,690]
[null,null,null,null,null,null,null,null,null,null,null,null,null,null,null,null,null,null,null,null,null,null,null,null,null,null,null,null,null,null,null,null,null,null,null,691]
[null,null,null,null,null,null,null,null,null,null,null,null,null,null,null,null,null,null,null,null,null,null,null,null,null,null,null,null,null,null,null,null,null,null,null,692]
[null,null,null,null,null,null,null,null,null,null,null,null,null,null,null,null,null,null,null,null,null,null,null,null,null,null,null,null,null,null,null,null,null,null,null,693]
[null,null,null,null,null,null,null,null,null,null,null,null,null,null,null,null,null,null,null,null,null,null,null,null,null,null,null,null,null,null,null,null,null,null,null,694]
[null,null,null,null,null,null,null,null,null,null,null,null,null,null,null,null,null,null,null,null,null,null,null,null,null,null,null,null,null,null,null,null,null,null,null,695]
[null,null,null,null,null,null,null,null,null,null,null,null,null,null,null,null,null,null,null,null,null,null,null,null,null,null,null,null,null,null,null,null,null,null,null,696]
[null,null,null,null,null,null,null,null,null,null,null,null,null,null,null,null,null,null,null,null,null,null,null,null,null,null,null,null,null,null,null,null,null,null,null,697]
[null,null,null,null,null,null,null,null,null,null,null,null,null,null,null,null,null,null,null,null,null,null,null,null,null,null,null,null,null,null,null,null,null,null,null,698]
[null,null,null,null,null,null,null,null,null,null,null,null,null,null,null,null,null,null,null,null,null,null,null,null,null,null,null,null,null,null,null,null,null,null,null,699]
[null,null,null,null,null,null,null,null,null,null,null,null,null,null,null,null,null,null,null,null,null,null,null,null,null,null,null,null,null,null,null,null,null,null,null,700]
[null,null,null,null,null,null,null,null,null,null,null,null,null,null,null,null,null,null,null,null,null,null,null,null,null,null,null,null,null,null,null,null,null,null,null,701]
[null,null,null,null,null,null,null,null,null,null,null,null,null,null,null,null,null,null,null,null,null,null,null,null,null,null,null,null,null,null,null,null,null,null,null,702]
[null,null,null,null,null,null,null,null,null,null,null,null,null,null,null,null,null,null,null,null,null,null,null,null,null,null,null,null,null,null,null,null,null,null,null,703]
[null,null,null,null,null,null,null,null,null,null,null,null,null,null,null,null,null,null,null,null,null,null,null,null,null,null,null,null,null,null,null,null,null,null,null,704]
[null,null,null,null,null,null,null,null,null,null,null,null,null,null,null,null,null,null,null,null,null,null,null,null,null,null,null,null,null,null,null,null,null,null,null,705]
[null,null,null,null,null,null,null,null,null,null,null,null,null,null,null,null,null,null,null,null,null,null,null,null,null,null,null,null,null,null,null,null,null,null,null,706]
[null,null,null,null,null,null,null,null,null,null,null,null,null,null,null,null,null,null,null,null,null,null,null,null,null,null,null,null,null,null,null,null,null,null,null,707]
[null,null,null,null,null,null,null,null,null,null,null,null,null,null,null,null,null,null,null,null,null,null,null,null,null,null,null,null,null,null,null,null,null,null,null,708]
[null,null,null,null,null,null,null,null,null,null,null,null,null,null,null,null,null,null,null,null,null,null,null,null,null,null,null,null,null,null,null,null,null,null,null,709]
[null,null,null,null,null,null,null,null,null,null,null,null,null,null,null,null,null,null,null,null,null,null,null,null,null,null,null,null,null,null,null,null,null,null,null,710]
[null,null,null,null,null,null,null,null,null,null,null,null,null,null,null,null,null,null,null,null,null,null,null,null,null,null,null,null,null,null,null,null,null,null,null,711]
[null,null,null,null,null,null,null,null,null,null,null,null,null,null,null,null,null,null,null,null,null,null,null,null,null,null,null,null,null,null,null,null,null,null,null,712]
[null,null,null,null,null,null,null,null,null,null,null,null,null,null,null,null,null,null,null,null,null,null,null,null,null,null,null,null,null,null,null,null,null,null,null,713]
[null,null,null,null,null,null,null,null,null,null,null,null,null,null,null,null,null,null,null,null,null,null,null,null,null,null,null,null,null,null,null,null,null,null,null,714]
[null,null,null,null,null,null,null,null,null,null,null,null,null,null,null,null,null,null,null,null,null,null,null,null,null,null,null,null,null,null,null,null,null,null,null,715]
[null,null,null,null,null,null,null,null,null,null,null,null,null,null,null,null,null,null,null,null,null,null,null,null,null,null,null,null,null,null,null,null,null,null,null,716]
[null,null,null,null,null,null,null,null,null,null,null,null,null,null,null,null,null,null,null,null,null,null,null,null,null,null,null,null,null,null,null,null,null,null,null,717]
[null,null,null,null,null,null,null,null,null,null,null,null,null,null,null,null,null,null,null,null,null,null,null,null,null,null,null,null,null,null,null,null,null,null,null,718]
[null,null,null,null,null,null,null,null,null,null,null,null,null,null,null,null,null,null,null,null,null,null,null,null,null,null,null,null,null,null,null,null,null,null,null,719]
[null,null,null,null,null,null,null,null,null,null,null,null,null,null,null,null,null,null,null,null,null,null,null,null,null,null,null,null,null,null,null,null,null,null,null,720]
[null,null,null,null,null,null,null,null,null,null,null,null,null,null,null,null,null,null,null,null,null,null,null,null,null,null,null,null,null,null,null,null,null,null,null,721]
[null,null,null,null,null,null,null,null,null,null,null,null,null,null,null,null,null,null,null,null,null,null,null,null,null,null,null,null,null,null,null,null,null,null,null,722]
[null,null,null,null,null,null,null,null,null,null,null,null,null,null,null,null,null,null,null,null,null,null,null,null,null,null,null,null,null,null,null,null,null,null,null,723]
[null,null,null,null,null,null,null,null,null,null,null,null,null,null,null,null,null,null,null,null,null,null,null,null,null,null,null,null,null,null,null,null,null,null,null,724]
[null,null,null,null,null,null,null,null,null,null,null,null,null,null,null,null,null,null,null,null,null,null,null,null,null,null,null,null,null,null,null,null,null,null,null,725]
[null,null,null,null,null,null,null,null,null,null,null,null,null,null,null,null,null,null,null,null,null,null,null,null,null,null,null,null,null,null,null,null,null,null,null,726]
[null,null,null,null,null,null,null,null,null,null,null,null,null,null,null,null,null,null,null,null,null,null,null,null,null,null,null,null,null,null,null,null,null,null,null,727]
[null,null,null,null,null,null,null,null,null,null,null,null,null,null,null,null,null,null,null,null,null,null,null,null,null,null,null,null,null,null,null,null,null,null,null,728]
[null,null,null,null,null,null,null,null,null,null,null,null,null,null,null,null,null,null,null,null,null,null,null,null,null,null,null,null,null,null,null,null,null,null,null,729]
[null,null,null,null,null,null,null,null,null,null,null,null,null,null,null,null,null,null,null,null,null,null,null,null,null,null,null,null,null,null,null,null,null,null,null,730]
[null,null,null,null,null,null,null,null,null,null,null,null,null,null,null,null,null,null,null,null,null,null,null,null,null,null,null,null,null,null,null,null,null,null,null,731]
[null,null,null,null,null,null,null,null,null,null,null,null,null,null,null,null,null,null,null,null,null,null,null,null,null,null,null,null,null,null,null,null,null,null,null,732]
[null,null,null,null,null,null,null,null,null,null,null,null,null,null,null,null,null,null,null,null,null,null,null,null,null,null,null,null,null,null,null,null,null,null,null,733]
[null,null,null,null,null,null,null,null,null,null,null,null,null,null,null,null,null,null,null,null,null,null,null,null,null,null,null,null,null,null,null,null,null,null,null,734]
[null,null,null,null,null,null,null,null,null,null,null,null,null,null,null,null,null,null,null,null,null,null,null,null,null,null,null,null,null,null,null,null,null,null,null,735]
[null,null,null,null,null,null,null,null,null,null,null,null,null,null,null,null,null,null,null,null,null,null,null,null,null,null,null,null,null,null,null,null,null,null,null,736]
[null,null,null,null,null,null,null,null,null,null,null,null,null,null,null,null,null,null,null,null,null,null,null,null,null,null,null,null,null,null,null,null,null,null,null,737]
[null,null,null,null,null,null,null,null,null,null,null,null,null,null,null,null,null,null,null,null,null,null,null,null,null,null,null,null,null,null,null,null,null,null,null,738]
[null,null,null,null,null,null,null,null,null,null,null,null,null,null,null,null,null,null,null,null,null,null,null,null,null,null,null,null,null,null,null,null,null,null,null,739]
[null,null,null,null,null,null,null,null,null,null,null,null,null,null,null,null,null,null,null,null,null,null,null,null,null,null,null,null,null,null,null,null,null,null,null,740]
[null,null,null,null,null,null,null,null,null,null,null,null,null,null,null,null,null,null,null,null,null,null,null,null,null,null,null,null,null,null,null,null,null,null,null,741]
[null,null,null,null,null,null,null,null,null,null,null,null,null,null,null,null,null,null,null,null,null,null,null,null,null,null,null,null,null,null,null,null,null,null,null,742]
[null,null,null,null,null,null,null,null,null,null,null,null,null,null,null,null,null,null,null,null,null,null,null,null,null,null,null,null,null,null,null,null,null,null,null,743]
[null,null,null,null,null,null,null,null,null,null,null,null,null,null,null,null,null,null,null,null,null,null,null,null,null,null,null,null,null,null,null,null,null,null,null,744]
[null,null,null,null,null,null,null,null,null,null,null,null,null,null,null,null,null,null,null,null,null,null,null,null,null,null,null,null,null,null,null,null,null,null,null,745]
[null,null,null,null,null,null,null,null,null,null,null,null,null,null,null,null,null,null,null,null,null,null,null,null,null,null,null,null,null,null,null,null,null,null,null,746]
[null,null,null,null,null,null,null,null,null,null,null,null,null,null,null,null,null,null,null,null,null,null,null,null,null,null,null,null,null,null,null,null,null,null,null,747]
[null,null,null,null,null,null,null,null,null,null,null,null,null,null,null,null,null,null,null,null,null,null,null,null,null,null,null,null,null,null,null,null,null,null,null,748]
[null,null,null,null,null,null,null,null,null,null,null,null,null,null,null,null,null,null,null,null,null,null,null,null,null,null,null,null,null,null,null,null,null,null,null,749]
[null,null,null,null,null,null,null,null,null,null,null,null,null,null,null,null,null,null,null,null,null,null,null,null,null,null,null,null,null,null,null,null,null,null,null,750]
[null,null,null,null,null,null,null,null,null,null,null,null,null,null,null,null,null,null,null,null,null,null,null,null,null,null,null,null,null,null,null,null,null,null,null,751]
[null,null,null,null,null,null,null,null,null,null,null,null,null,null,null,null,null,null,null,null,null,null,null,null,null,null,null,null,null,null,null,null,null,null,null,752]
[null,null,null,null,null,null,null,null,null,null,null,null,null,null,null,null,null,null,null,null,null,null,null,null,null,null,null,null,null,null,null,null,null,null,null,753]
[null,null,null,null,null,null,null,null,null,null,null,null,null,null,null,null,null,null,null,null,null,null,null,null,null,null,null,null,null,null,null,null,null,null,null,754]
[null,null,null,null,null,null,null,null,null,null,null,null,null,null,null,null,null,null,null,null,null,null,null,null,null,null,null,null,null,null,null,null,null,null,null,755]
[null,null,null,null,null,null,null,null,null,null,null,null,null,null,null,null,null,null,null,null,null,null,null,null,null,null,null,null,null,null,null,null,null,null,null,756]
[null,null,null,null,null,null,null,null,null,null,null,null,null,null,null,null,null,null,null,null,null,null,null,null,null,null,null,null,null,null,null,null,null,null,null,757]
[null,null,null,null,null,null,null,null,null,null,null,null,null,null,null,null,null,null,null,null,null,null,null,null,null,null,null,null,null,null,null,null,null,null,null,758]
[null,null,null,null,null,null,null,null,null,null,null,null,null,null,null,null,null,null,null,null,null,null,null,null,null,null,null,null,null,null,null,null,null,null,null,759]
[null,null,null,null,null,null,null,null,null,null,null,null,null,null,null,null,null,null,null,null,null,null,null,null,null,null,null,null,null,null,null,null,null,null,null,760]
[null,null,null,null,null,null,null,null,null,null,null,null,null,null,null,null,null,null,null,null,null,null,null,null,null,null,null,null,null,null,null,null,null,null,null,761]
[null,null,null,null,null,null,null,null,null,null,null,null,null,null,null,null,null,null,null,null,null,null,null,null,null,null,null,null,null,null,null,null,null,null,null,762]
[null,null,null,null,null,null,null,null,null,null,null,null,null,null,null,null,null,null,null,null,null,null,null,null,null,null,null,null,null,null,null,null,null,null,null,763]
[null,null,null,null,null,null,null,null,null,null,null,null,null,null,null,null,null,null,null,null,null,null,null,null,null,null,null,null,null,null,null,null,null,null,null,764]
[null,null,null,null,null,null,null,null,null,null,null,null,null,null,null,null,null,null,null,null,null,null,null,null,null,null,null,null,null,null,null,null,null,null,null,765]
[null,null,null,null,null,null,null,null,null,null,null,null,null,null,null,null,null,null,null,null,null,null,null,null,null,null,null,null,null,null,null,null,null,null,null,766]
[null,null,null,null,null,null,null,null,null,null,null,null,null,null,null,null,null,null,null,null,null,null,null,null,null,null,null,null,null,null,null,null,null,null,null,767]
[null,null,null,null,null,null,null,null,null,null,null,null,null,null,null,null,null,null,null,null,null,null,null,null,null,null,null,null,null,null,null,null,null,null,null,768]
[null,null,null,null,null,null,null,null,null,null,null,null,null,null,null,null,null,null,null,null,null,null,null,null,null,null,null,null,null,null,null,null,null,null,null,769]
[null,null,null,null,null,null,null,null,null,null,null,null,null,null,null,null,null,null,null,null,null,null,null,null,null,null,null,null,null,null,null,null,null,null,null,770]
[null,null,null,null,null,null,null,null,null,null,null,null,null,null,null,null,null,null,null,null,null,null,null,null,null,null,null,null,null,null,null,null,null,null,null,771]
[null,null,null,null,null,null,null,null,null,null,null,null,null,null,null,null,null,null,null,null,null,null,null,null,null,null,null,null,null,null,null,null,null,null,null,772]
[null,null,null,null,null,null,null,null,null,null,null,null,null,null,null,null,null,null,null,null,null,null,null,null,null,null,null,null,null,null,null,null,null,null,null,773]
[null,null,null,null,null,null,null,null,null,null,null,null,null,null,null,null,null,null,null,null,null,null,null,null,null,null,null,null,null,null,null,null,null,null,null,774]
[null,null,null,null,null,null,null,null,null,null,null,null,null,null,null,null,null,null,null,null,null,null,null,null,null,null,null,null,null,null,null,null,null,null,null,775]
[null,null,null,null,null,null,null,null,null,null,null,null,null,null,null,null,null,null,null,null,null,null,null,null,null,null,null,null,null,null,null,null,null,null,null,776]
[null,null,null,null,null,null,null,null,null,null,null,null,null,null,null,null,null,null,null,null,null,null,null,null,null,null,null,null,null,null,null,null,null,null,null,777]
[null,null,null,null,null,null,null,null,null,null,null,null,null,null,null,null,null,null,null,null,null,null,null,null,null,null,null,null,null,null,null,null,null,null,null,778]
[null,null,null,null,null,null,null,null,null,null,null,null,null,null,null,null,null,null,null,null,null,null,null,null,null,null,null,null,null,null,null,null,null,null,null,779]
[null,null,null,null,null,null,null,null,null,null,null,null,null,null,null,null,null,null,null,null,null,null,null,null,null,null,null,null,null,null,null,null,null,null,null,780]
[null,null,null,null,null,null,null,null,null,null,null,null,null,null,null,null,null,null,null,null,null,null,null,null,null,null,null,null,null,null,null,null,null,null,null,781]
[null,null,null,null,null,null,null,null,null,null,null,null,null,null,null,null,null,null,null,null,null,null,null,null,null,null,null,null,null,null,null,null,null,null,null,782]
[null,null,null,null,null,null,null,null,null,null,null,null,null,null,null,null,null,null,null,null,null,null,null,null,null,null,null,null,null,null,null,null,null,null,null,783]
[null,null,null,null,null,null,null,null,null,null,null,null,null,null,null,null,null,null,null,null,null,null,null,null,null,null,null,null,null,null,null,null,null,null,null,784]
[null,null,null,null,null,null,null,null,null,null,null,null,null,null,null,null,null,null,null,null,null,null,null,null,null,null,null,null,null,null,null,null,null,null,null,785]
[null,null,null,null,null,null,null,null,null,null,null,null,null,null,null,null,null,null,null,null,null,null,null,null,null,null,null,null,null,null,null,null,null,null,null,786]
[null,null,null,null,null,null,null,null,null,null,null,null,null,null,null,null,null,null,null,null,null,null,null,null,null,null,null,null,null,null,null,null,null,null,null,787]
[null,null,null,null,null,null,null,null,null,null,null,null,null,null,null,null,null,null,null,null,null,null,null,null,null,null,null,null,null,null,null,null,null,null,null,788]
[null,null,null,null,null,null,null,null,null,null,null,null,null,null,null,null,null,null,null,null,null,null,null,null,null,null,null,null,null,null,null,null,null,null,null,789]
[null,null,null,null,null,null,null,null,null,null,null,null,null,null,null,null,null,null,null,null,null,null,null,null,null,null,null,null,null,null,null,null,null,null,null,790]
[null,null,null,null,null,null,null,null,null,null,null,null,null,null,null,null,null,null,null,null,null,null,null,null,null,null,null,null,null,null,null,null,null,null,null,791]
[null,null,null,null,null,null,null,null,null,null,null,null,null,null,null,null,null,null,null,null,null,null,null,null,null,null,null,null,null,null,null,null,null,null,null,792]
[null,null,null,null,null,null,null,null,null,null,null,null,null,null,null,null,null,null,null,null,null,null,null,null,null,null,null,null,null,null,null,null,null,null,null,793]
[null,null,null,null,null,null,null,null,null,null,null,null,null,null,null,null,null,null,null,null,null,null,null,null,null,null,null,null,null,null,null,null,null,null,null,794]
[null,null,null,null,null,null,null,null,null,null,null,null,null,null,null,null,null,null,null,null,null,null,null,null,null,null,null,null,null,null,null,null,null,null,null,795]
[null,null,null,null,null,null,null,null,null,null,null,null,null,null,null,null,null,null,null,null,null,null,null,null,null,null,null,null,null,null,null,null,null,null,null,796]
[null,null,null,null,null,null,null,null,null,null,null,null,null,null,null,null,null,null,null,null,null,null,null,null,null,null,null,null,null,null,null,null,null,null,null,797]
[null,null,null,null,null,null,null,null,null,null,null,null,null,null,null,null,null,null,null,null,null,null,null,null,null,null,null,null,null,null,null,null,null,null,null,798]
[null,null,null,null,null,null,null,null,null,null,null,null,null,null,null,null,null,null,null,null,null,null,null,null,null,null,null,null,null,null,null,null,null,null,null,799]
[null,null,null,null,null,null,null,null,null,null,null,null,null,null,null,null,null,null,null,null,null,null,null,null,null,null,null,null,null,null,null,null,null,null,null,800]
[null,null,null,null,null,null,null,null,null,null,null,null,null,null,null,null,null,null,null,null,null,null,null,null,null,null,null,null,null,null,null,null,null,null,null,801]
[null,null,null,null,null,null,null,null,null,null,null,null,null,null,null,null,null,null,null,null,null,null,null,null,null,null,null,null,null,null,null,null,null,null,null,802]
[null,null,null,null,null,null,null,null,null,null,null,null,null,null,null,null,null,null,null,null,null,null,null,null,null,null,null,null,null,null,null,null,null,null,null,803]
[null,null,null,null,null,null,null,null,null,null,null,null,null,null,null,null,null,null,null,null,null,null,null,null,null,null,null,null,null,null,null,null,null,null,null,804]
[null,null,null,null,null,null,null,null,null,null,null,null,null,null,null,null,null,null,null,null,null,null,null,null,null,null,null,null,null,null,null,null,null,null,null,805]
[null,null,null,null,null,null,null,null,null,null,null,null,null,null,null,null,null,null,null,null,null,null,null,null,null,null,null,null,null,null,null,null,null,null,null,806]
[null,null,null,null,null,null,null,null,null,null,null,null,null,null,null,null,null,null,null,null,null,null,null,null,null,null,null,null,null,null,null,null,null,null,null,807]
[null,null,null,null,null,null,null,null,null,null,null,null,null,null,null,null,null,null,null,null,null,null,null,null,null,null,null,null,null,null,null,null,null,null,null,808]
[null,null,null,null,null,null,null,null,null,null,null,null,null,null,null,null,null,null,null,null,null,null,null,null,null,null,null,null,null,null,null,null,null,null,null,809]
[null,null,null,null,null,null,null,null,null,null,null,null,null,null,null,null,null,null,null,null,null,null,null,null,null,null,null,null,null,null,null,null,null,null,null,810]
[null,null,null,null,null,null,null,null,null,null,null,null,null,null,null,null,null,null,null,null,null,null,null,null,null,null,null,null,null,null,null,null,null,null,null,811]
[null,null,null,null,null,null,null,null,null,null,null,null,null,null,null,null,null,null,null,null,null,null,null,null,null,null,null,null,null,null,null,null,null,null,null,812]
[null,null,null,null,null,null,null,null,null,null,null,null,null,null,null,null,null,null,null,null,null,null,null,null,null,null,null,null,null,null,null,null,null,null,null,813]
[null,null,null,null,null,null,null,null,null,null,null,null,null,null,null,null,null,null,null,null,null,null,null,null,null,null,null,null,null,null,null,null,null,null,null,814]
[null,null,null,null,null,null,null,null,null,null,null,null,null,null,null,null,null,null,null,null,null,null,null,null,null,null,null,null,null,null,null,null,null,null,null,815]
[null,null,null,null,null,null,null,null,null,null,null,null,null,null,null,null,null,null,null,null,null,null,null,null,null,null,null,null,null,null,null,null,null,null,null,816]
[null,null,null,null,null,null,null,null,null,null,null,null,null,null,null,null,null,null,null,null,null,null,null,null,null,null,null,null,null,null,null,null,null,null,null,817]
[null,null,null,null,null,null,null,null,null,null,null,null,null,null,null,null,null,null,null,null,null,null,null,null,null,null,null,null,null,null,null,null,null,null,null,818]
[null,null,null,null,null,null,null,null,null,null,null,null,null,null,null,null,null,null,null,null,null,null,null,null,null,null,null,null,null,null,null,null,null,null,null,819]
[null,null,null,null,null,null,null,null,null,null,null,null,null,null,null,null,null,null,null,null,null,null,null,null,null,null,null,null,null,null,null,null,null,null,null,820]
[null,null,null,null,null,null,null,null,null,null,null,null,null,null,null,null,null,null,null,null,null,null,null,null,null,null,null,null,null,null,null,null,null,null,null,821]
[null,null,null,null,null,null,null,null,null,null,null,null,null,null,null,null,null,null,null,null,null,null,null,null,null,null,null,null,null,null,null,null,null,null,null,822]
[null,null,null,null,null,null,null,null,null,null,null,null,null,null,null,null,null,null,null,null,null,null,null,null,null,null,null,null,null,null,null,null,null,null,null,823]
[null,null,null,null,null,null,null,null,null,null,null,null,null,null,null,null,null,null,null,null,null,null,null,null,null,null,null,null,null,null,null,null,null,null,null,824]
[null,null,null,null,null,null,null,null,null,null,null,null,null,null,null,null,null,null,null,null,null,null,null,null,null,null,null,null,null,null,null,null,null,null,null,825]
[null,null,null,null,null,null,null,null,null,null,null,null,null,null,null,null,null,null,null,null,null,null,null,null,null,null,null,null,null,null,null,null,null,null,null,826]
[null,null,null,null,null,null,null,null,null,null,null,null,null,null,null,null,null,null,null,null,null,null,null,null,null,null,null,null,null,null,null,null,null,null,null,827]
[null,null,null,null,null,null,null,null,null,null,null,null,null,null,null,null,null,null,null,null,null,null,null,null,null,null,null,null,null,null,null,null,null,null,null,828]
[null,null,null,null,null,null,null,null,null,null,null,null,null,null,null,null,null,null,null,null,null,null,null,null,null,null,null,null,null,null,null,null,null,null,null,829]
[null,null,null,null,null,null,null,null,null,null,null,null,null,null,null,null,null,null,null,null,null,null,null,null,null,null,null,null,null,null,null,null,null,null,null,830]
[null,null,null,null,null,null,null,null,null,null,null,null,null,null,null,null,null,null,null,null,null,null,null,null,null,null,null,null,null,null,null,null,null,null,null,831]
[null,null,null,null,null,null,null,null,null,null,null,null,null,null,null,null,null,null,null,null,null,null,null,null,null,null,null,null,null,null,null,null,null,null,null,832]
[null,null,null,null,null,null,null,null,null,null,null,null,null,null,null,null,null,null,null,null,null,null,null,null,null,null,null,null,null,null,null,null,null,null,null,833]
[null,null,null,null,null,null,null,null,null,null,null,null,null,null,null,null,null,null,null,null,null,null,null,null,null,null,null,null,null,null,null,null,null,null,null,834]
[null,null,null,null,null,null,null,null,null,null,null,null,null,null,null,null,null,null,null,null,null,null,null,null,null,null,null,null,null,null,null,null,null,null,null,835]
[null,null,null,null,null,null,null,null,null,null,null,null,null,null,null,null,null,null,null,null,null,null,null,null,null,null,null,null,null,null,null,null,null,null,null,836]
[null,null,null,null,null,null,null,null,null,null,null,null,null,null,null,null,null,null,null,null,null,null,null,null,null,null,null,null,null,null,null,null,null,null,null,837]
[null,null,null,null,null,null,null,null,null,null,null,null,null,null,null,null,null,null,null,null,null,null,null,null,null,null,null,null,null,null,null,null,null,null,null,838]
[null,null,null,null,null,null,null,null,null,null,null,null,null,null,null,null,null,null,null,null,null,null,null,null,null,null,null,null,null,null,null,null,null,null,null,839]
[null,null,null,null,null,null,null,null,null,null,null,null,null,null,null,null,null,null,null,null,null,null,null,null,null,null,null,null,null,null,null,null,null,null,null,840]
[null,null,null,null,null,null,null,null,null,null,null,null,null,null,null,null,null,null,null,null,null,null,null,null,null,null,null,null,null,null,null,null,null,null,null,841]
[null,null,null,null,null,null,null,null,null,null,null,null,null,null,null,null,null,null,null,null,null,null,null,null,null,null,null,null,null,null,null,null,null,null,null,842]
[null,null,null,null,null,null,null,null,null,null,null,null,null,null,null,null,null,null,null,null,null,null,null,null,null,null,null,null,null,null,null,null,null,null,null,843]
[null,null,null,null,null,null,null,null,null,null,null,null,null,null,null,null,null,null,null,null,null,null,null,null,null,null,null,null,null,null,null,null,null,null,null,844]
[null,null,null,null,null,null,null,null,null,null,null,null,null,null,null,null,null,null,null,null,null,null,null,null,null,null,null,null,null,null,null,null,null,null,null,845]
[null,null,null,null,null,null,null,null,null,null,null,null,null,null,null,null,null,null,null,null,null,null,null,null,null,null,null,null,null,null,null,null,null,null,null,846]
[null,null,null,null,null,null,null,null,null,null,null,null,null,null,null,null,null,null,null,null,null,null,null,null,null,null,null,null,null,null,null,null,null,null,null,847]
[null,null,null,null,null,null,null,null,null,null,null,null,null,null,null,null,null,null,null,null,null,null,null,null,null,null,null,null,null,null,null,null,null,null,null,848]
[null,null,null,null,null,null,null,null,null,null,null,null,null,null,null,null,null,null,null,null,null,null,null,null,null,null,null,null,null,null,null,null,null,null,null,849]
[null,null,null,null,null,null,null,null,null,null,null,null,null,null,null,null,null,null,null,null,null,null,null,null,null,null,null,null,null,null,null,null,null,null,null,850]
[null,null,null,null,null,null,null,null,null,null,null,null,null,null,null,null,null,null,null,null,null,null,null,null,null,null,null,null,null,null,null,null,null,null,null,851]
[null,null,null,null,null,null,null,null,null,null,null,null,null,null,null,null,null,null,null,null,null,null,null,null,null,null,null,null,null,null,null,null,null,null,null,852]
[null,null,null,null,null,null,null,null,null,null,null,null,null,null,null,null,null,null,null,null,null,null,null,null,null,null,null,null,null,null,null,null,null,null,null,853]
[null,null,null,null,null,null,null,null,null,null,null,null,null,null,null,null,null,null,null,null,null,null,null,null,null,null,null,null,null,null,null,null,null,null,null,854]
[null,null,null,null,null,null,null,null,null,null,null,null,null,null,null,null,null,null,null,null,null,null,null,null,null,null,null,null,null,null,null,null,null,null,null,855]
[null,null,null,null,null,null,null,null,null,null,null,null,null,null,null,null,null,null,null,null,null,null,null,null,null,null,null,null,null,null,null,null,null,null,null,856]
[null,null,null,null,null,null,null,null,null,null,null,null,null,null,null,null,null,null,null,null,null,null,null,null,null,null,null,null,null,null,null,null,null,null,null,857]
[null,null,null,null,null,null,null,null,null,null,null,null,null,null,null,null,null,null,null,null,null,null,null,null,null,null,null,null,null,null,null,null,null,null,null,858]
[null,null,null,null,null,null,null,null,null,null,null,null,null,null,null,null,null,null,null,null,null,null,null,null,null,null,null,null,null,null,null,null,null,null,null,859]
[null,null,null,null,null,null,null,null,null,null,null,null,null,null,null,null,null,null,null,null,null,null,null,null,null,null,null,null,null,null,null,null,null,null,null,860]
[null,null,null,null,null,null,null,null,null,null,null,null,null,null,null,null,null,null,null,null,null,null,null,null,null,null,null,null,null,null,null,null,null,null,null,861]
[null,null,null,null,null,null,null,null,null,null,null,null,null,null,null,null,null,null,null,null,null,null,null,null,null,null,null,null,null,null,null,null,null,null,null,862]
[null,null,null,null,null,null,null,null,null,null,null,null,null,null,null,null,null,null,null,null,null,null,null,null,null,null,null,null,null,null,null,null,null,null,null,863]
[null,null,null,null,null,null,null,null,null,null,null,null,null,null,null,null,null,null,null,null,null,null,null,null,null,null,null,null,null,null,null,null,null,null,null,864]
[null,null,null,null,null,null,null,null,null,null,null,null,null,null,null,null,null,null,null,null,null,null,null,null,null,null,null,null,null,null,null,null,null,null,null,865]
[null,null,null,null,null,null,null,null,null,null,null,null,null,null,null,null,null,null,null,null,null,null,null,null,null,null,null,null,null,null,null,null,null,null,null,866]
[null,null,null,null,null,null,null,null,null,null,null,null,null,null,null,null,null,null,null,null,null,null,null,null,null,null,null,null,null,null,null,null,null,null,null,867]
[null,null,null,null,null,null,null,null,null,null,null,null,null,null,null,null,null,null,null,null,null,null,null,null,null,null,null,null,null,null,null,null,null,null,null,868]
[null,null,null,null,null,null,null,null,null,null,null,null,null,null,null,null,null,null,null,null,null,null,null,null,null,null,null,null,null,null,null,null,null,null,null,869]
[null,null,null,null,null,null,null,null,null,null,null,null,null,null,null,null,null,null,null,null,null,null,null,null,null,null,null,null,null,null,null,null,null,null,null,870]
[null,null,null,null,null,null,null,null,null,null,null,null,null,null,null,null,null,null,null,null,null,null,null,null,null,null,null,null,null,null,null,null,null,null,null,871]
[null,null,null,null,null,null,null,null,null,null,null,null,null,null,null,null,null,null,null,null,null,null,null,null,null,null,null,null,null,null,null,null,null,null,null,872]
[null,null,null,null,null,null,null,null,null,null,null,null,null,null,null,null,null,null,null,null,null,null,null,null,null,null,null,null,null,null,null,null,null,null,null,873]
[null,null,null,null,null,null,null,null,null,null,null,null,null,null,null,null,null,null,null,null,null,null,null,null,null,null,null,null,null,null,null,null,null,null,null,874]
[null,null,null,null,null,null,null,null,null,null,null,null,null,null,null,null,null,null,null,null,null,null,null,null,null,null,null,null,null,null,null,null,null,null,null,875]
[null,null,null,null,null,null,null,null,null,null,null,null,null,null,null,null,null,null,null,null,null,null,null,null,null,null,null,null,null,null,null,null,null,null,null,876]
[null,null,null,null,null,null,null,null,null,null,null,null,null,null,null,null,null,null,null,null,null,null,null,null,null,null,null,null,null,null,null,null,null,null,null,877]
[null,null,null,null,null,null,null,null,null,null,null,null,null,null,null,null,null,null,null,null,null,null,null,null,null,null,null,null,null,null,null,null,null,null,null,878]
[null,null,null,null,null,null,null,null,null,null,null,null,null,null,null,null,null,null,null,null,null,null,null,null,null,null,null,null,null,null,null,null,null,null,null,879]
[null,null,null,null,null,null,null,null,null,null,null,null,null,null,null,null,null,null,null,null,null,null,null,null,null,null,null,null,null,null,null,null,null,null,null,880]
[null,null,null,null,null,null,null,null,null,null,null,null,null,null,null,null,null,null,null,null,null,null,null,null,null,null,null,null,null,null,null,null,null,null,null,881]
[null,null,null,null,null,null,null,null,null,null,null,null,null,null,null,null,null,null,null,null,null,null,null,null,null,null,null,null,null,null,null,null,null,null,null,882]
[null,null,null,null,null,null,null,null,null,null,null,null,null,null,null,null,null,null,null,null,null,null,null,null,null,null,null,null,null,null,null,null,null,null,null,883]
[null,null,null,null,null,null,null,null,null,null,null,null,null,null,null,null,null,null,null,null,null,null,null,null,null,null,null,null,null,null,null,null,null,null,null,884]
[null,null,null,null,null,null,null,null,null,null,null,null,null,null,null,null,null,null,null,null,null,null,null,null,null,null,null,null,null,null,null,null,null,null,null,885]
[null,null,null,null,null,null,null,null,null,null,null,null,null,null,null,null,null,null,null,null,null,null,null,null,null,null,null,null,null,null,null,null,null,null,null,886]
[null,null,null,null,null,null,null,null,null,null,null,null,null,null,null,null,null,null,null,null,null,null,null,null,null,null,null,null,null,null,null,null,null,null,null,887]
[null,null,null,null,null,null,null,null,null,null,null,null,null,null,null,null,null,null,null,null,null,null,null,null,null,null,null,null,null,null,null,null,null,null,null,888]
[null,null,null,null,null,null,null,null,null,null,null,null,null,null,null,null,null,null,null,null,null,null,null,null,null,null,null,null,null,null,null,null,null,null,null,889]
[null,null,null,null,null,null,null,null,null,null,null,null,null,null,null,null,null,null,null,null,null,null,null,null,null,null,null,null,null,null,null,null,null,null,null,890]
[null,null,null,null,null,null,null,null,null,null,null,null,null,null,null,null,null,null,null,null,null,null,null,null,null,null,null,null,null,null,null,null,null,null,null,891]
[null,null,null,null,null,null,null,null,null,null,null,null,null,null,null,null,null,null,null,null,null,null,null,null,null,null,null,null,null,null,null,null,null,null,null,892]
[null,null,null,null,null,null,null,null,null,null,null,null,null,null,null,null,null,null,null,null,null,null,null,null,null,null,null,null,null,null,null,null,null,null,null,893]
[null,null,null,null,null,null,null,null,null,null,null,null,null,null,null,null,null,null,null,null,null,null,null,null,null,null,null,null,null,null,null,null,null,null,null,894]
[null,null,null,null,null,null,null,null,null,null,null,null,null,null,null,null,null,null,null,null,null,null,null,null,null,null,null,null,null,null,null,null,null,null,null,895]
[null,null,null,null,null,null,null,null,null,null,null,null,null,null,null,null,null,null,null,null,null,null,null,null,null,null,null,null,null,null,null,null,null,null,null,896]
[null,null,null,null,null,null,null,null,null,null,null,null,null,null,null,null,null,null,null,null,null,null,null,null,null,null,null,null,null,null,null,null,null,null,null,897]
[null,null,null,null,null,null,null,null,null,null,null,null,null,null,null,null,null,null,null,null,null,null,null,null,null,null,null,null,null,null,null,null,null,null,null,898]
[null,null,null,null,null,null,null,null,null,null,null,null,null,null,null,null,null,null,null,null,null,null,null,null,null,null,null,null,null,null,null,null,null,null,null,899]
[null,null,null,null,null,null,null,null,null,null,null,null,null,null,null,null,null,null,null,null,null,null,null,null,null,null,null,null,null,null,null,null,null,null,null,900]
[null,null,null,null,null,null,null,null,null,null,null,null,null,null,null,null,null,null,null,null,null,null,null,null,null,null,null,null,null,null,null,null,null,null,null,901]
[null,null,null,null,null,null,null,null,null,null,null,null,null,null,null,null,null,null,null,null,null,null,null,null,null,null,null,null,null,null,null,null,null,null,null,902]
[null,null,null,null,null,null,null,null,null,null,null,null,null,null,null,null,null,null,null,null,null,null,null,null,null,null,null,null,null,null,null,null,null,null,null,903]
[null,null,null,null,null,null,null,null,null,null,null,null,null,null,null,null,null,null,null,null,null,null,null,null,null,null,null,null,null,null,null,null,null,null,null,904]
[null,null,null,null,null,null,null,null,null,null,null,null,null,null,null,null,null,null,null,null,null,null,null,null,null,null,null,null,null,null,null,null,null,null,null,905]
[null,null,null,null,null,null,null,null,null,null,null,null,null,null,null,null,null,null,null,null,null,null,null,null,null,null,null,null,null,null,null,null,null,null,null,906]
[null,null,null,null,null,null,null,null,null,null,null,null,null,null,null,null,null,null,null,null,null,null,null,null,null,null,null,null,null,null,null,null,null,null,null,907]
[null,null,null,null,null,null,null,null,null,null,null,null,null,null,null,null,null,null,null,null,null,null,null,null,null,null,null,null,null,null,null,null,null,null,null,908]
[null,null,null,null,null,null,null,null,null,null,null,null,null,null,null,null,null,null,null,null,null,null,null,null,null,null,null,null,null,null,null,null,null,null,null,909]
[null,null,null,null,null,null,null,null,null,null,null,null,null,null,null,null,null,null,null,null,null,null,null,null,null,null,null,null,null,null,null,null,null,null,null,910]
[null,null,null,null,null,null,null,null,null,null,null,null,null,null,null,null,null,null,null,null,null,null,null,null,null,null,null,null,null,null,null,null,null,null,null,911]
[null,null,null,null,null,null,null,null,null,null,null,null,null,null,null,null,null,null,null,null,null,null,null,null,null,null,null,null,null,null,null,null,null,null,null,912]
[null,null,null,null,null,null,null,null,null,null,null,null,null,null,null,null,null,null,null,null,null,null,null,null,null,null,null,null,null,null,null,null,null,null,null,913]
[null,null,null,null,null,null,null,null,null,null,null,null,null,null,null,null,null,null,null,null,null,null,null,null,null,null,null,null,null,null,null,null,null,null,null,914]
[null,null,null,null,null,null,null,null,null,null,null,null,null,null,null,null,null,null,null,null,null,null,null,null,null,null,null,null,null,null,null,null,null,null,null,915]
[null,null,null,null,null,null,null,null,null,null,null,null,null,null,null,null,null,null,null,null,null,null,null,null,null,null,null,null,null,null,null,null,null,null,null,916]
[null,null,null,null,null,null,null,null,null,null,null,null,null,null,null,null,null,null,null,null,null,null,null,null,null,null,null,null,null,null,null,null,null,null,null,917]
[null,null,null,null,null,null,null,null,null,null,null,null,null,null,null,null,null,null,null,null,null,null,null,null,null,null,null,null,null,null,null,null,null,null,null,918]
[null,null,null,null,null,null,null,null,null,null,null,null,null,null,null,null,null,null,null,null,null,null,null,null,null,null,null,null,null,null,null,null,null,null,null,919]
[null,null,null,null,null,null,null,null,null,null,null,null,null,null,null,null,null,null,null,null,null,null,null,null,null,null,null,null,null,null,null,null,null,null,null,920]
[null,null,null,null,null,null,null,null,null,null,null,null,null,null,null,null,null,null,null,null,null,null,null,null,null,null,null,null,null,null,null,null,null,null,null,921]
[null,null,null,null,null,null,null,null,null,null,null,null,null,null,null,null,null,null,null,null,null,null,null,null,null,null,null,null,null,null,null,null,null,null,null,922]
[null,null,null,null,null,null,null,null,null,null,null,null,null,null,null,null,null,null,null,null,null,null,null,null,null,null,null,null,null,null,null,null,null,null,null,923]
[null,null,null,null,null,null,null,null,null,null,null,null,null,null,null,null,null,null,null,null,null,null,null,null,null,null,null,null,null,null,null,null,null,null,null,924]
[null,null,null,null,null,null,null,null,null,null,null,null,null,null,null,null,null,null,null,null,null,null,null,null,null,null,null,null,null,null,null,null,null,null,null,925]
[null,null,null,null,null,null,null,null,null,null,null,null,null,null,null,null,null,null,null,null,null,null,null,null,null,null,null,null,null,null,null,null,null,null,null,926]
[null,null,null,null,null,null,null,null,null,null,null,null,null,null,null,null,null,null,null,null,null,null,null,null,null,null,null,null,null,null,null,null,null,null,null,927]
[null,null,null,null,null,null,null,null,null,null,null,null,null,null,null,null,null,null,null,null,null,null,null,null,null,null,null,null,null,null,null,null,null,null,null,928]
[null,null,null,null,null,null,null,null,null,null,null,null,null,null,null,null,null,null,null,null,null,null,null,null,null,null,null,null,null,null,null,null,null,null,null,929]
[null,null,null,null,null,null,null,null,null,null,null,null,null,null,null,null,null,null,null,null,null,null,null,null,null,null,null,null,null,null,null,null,null,null,null,930]
[null,null,null,null,null,null,null,null,null,null,null,null,null,null,null,null,null,null,null,null,null,null,null,null,null,null,null,null,null,null,null,null,null,null,null,931]
[null,null,null,null,null,null,null,null,null,null,null,null,null,null,null,null,null,null,null,null,null,null,null,null,null,null,null,null,null,null,null,null,null,null,null,932]
[null,null,null,null,null,null,null,null,null,null,null,null,null,null,null,null,null,null,null,null,null,null,null,null,null,null,null,null,null,null,null,null,null,null,null,933]
[null,null,null,null,null,null,null,null,null,null,null,null,null,null,null,null,null,null,null,null,null,null,null,null,null,null,null,null,null,null,null,null,null,null,null,934]
[null,null,null,null,null,null,null,null,null,null,null,null,null,null,null,null,null,null,null,null,null,null,null,null,null,null,null,null,null,null,null,null,null,null,null,935]
[null,null,null,null,null,null,null,null,null,null,null,null,null,null,null,null,null,null,null,null,null,null,null,null,null,null,null,null,null,null,null,null,null,null,null,936]
[null,null,null,null,null,null,null,null,null,null,null,null,null,null,null,null,null,null,null,null,null,null,null,null,null,null,null,null,null,null,null,null,null,null,null,937]
[null,null,null,null,null,null,null,null,null,null,null,null,null,null,null,null,null,null,null,null,null,null,null,null,null,null,null,null,null,null,null,null,null,null,null,938]
[null,null,null,null,null,null,null,null,null,null,null,null,null,null,null,null,null,null,null,null,null,null,null,null,null,null,null,null,null,null,null,null,null,null,null,939]
[null,null,null,null,null,null,null,null,null,null,null,null,null,null,null,null,null,null,null,null,null,null,null,null,null,null,null,null,null,null,null,null,null,null,null,940]
[null,null,null,null,null,null,null,null,null,null,null,null,null,null,null,null,null,null,null,null,null,null,null,null,null,null,null,null,null,null,null,null,null,null,null,941]
[null,null,null,null,null,null,null,null,null,null,null,null,null,null,null,null,null,null,null,null,null,null,null,null,null,null,null,null,null,null,null,null,null,null,null,942]
[null,null,null,null,null,null,null,null,null,null,null,null,null,null,null,null,null,null,null,null,null,null,null,null,null,null,null,null,null,null,null,null,null,null,null,943]
[null,null,null,null,null,null,null,null,null,null,null,null,null,null,null,null,null,null,null,null,null,null,null,null,null,null,null,null,null,null,null,null,null,null,null,944]
[null,null,null,null,null,null,null,null,null,null,null,null,null,null,null,null,null,null,null,null,null,null,null,null,null,null,null,null,null,null,null,null,null,null,null,945]
[null,null,null,null,null,null,null,null,null,null,null,null,null,null,null,null,null,null,null,null,null,null,null,null,null,null,null,null,null,null,null,null,null,null,null,946]
[null,null,null,null,null,null,null,null,null,null,null,null,null,null,null,null,null,null,null,null,null,null,null,null,null,null,null,null,null,null,null,null,null,null,null,947]
[null,null,null,null,null,null,null,null,null,null,null,null,null,null,null,null,null,null,null,null,null,null,null,null,null,null,null,null,null,null,null,null,null,null,null,948]
[null,null,null,null,null,null,null,null,null,null,null,null,null,null,null,null,null,null,null,null,null,null,null,null,null,null,null,null,null,null,null,null,null,null,null,949]
[null,null,null,null,null,null,null,null,null,null,null,null,null,null,null,null,null,null,null,null,null,null,null,null,null,null,null,null,null,null,null,null,null,null,null,950]
[null,null,null,null,null,null,null,null,null,null,null,null,null,null,null,null,null,null,null,null,null,null,null,null,null,null,null,null,null,null,null,null,null,null,null,951]
[null,null,null,null,null,null,null,null,null,null,null,null,null,null,null,null,null,null,null,null,null,null,null,null,null,null,null,null,null,null,null,null,null,null,null,952]
[null,null,null,null,null,null,null,null,null,null,null,null,null,null,null,null,null,null,null,null,null,null,null,null,null,null,null,null,null,null,null,null,null,null,null,953]
[null,null,null,null,null,null,null,null,null,null,null,null,null,null,null,null,null,null,null,null,null,null,null,null,null,null,null,null,null,null,null,null,null,null,null,954]
[null,null,null,null,null,null,null,null,null,null,null,null,null,null,null,null,null,null,null,null,null,null,null,null,null,null,null,null,null,null,null,null,null,null,null,955]
[null,null,null,null,null,null,null,null,null,null,null,null,null,null,null,null,null,null,null,null,null,null,null,null,null,null,null,null,null,null,null,null,null,null,null,956]
[null,null,null,null,null,null,null,null,null,null,null,null,null,null,null,null,null,null,null,null,null,null,null,null,null,null,null,null,null,null,null,null,null,null,null,957]
[null,null,null,null,null,null,null,null,null,null,null,null,null,null,null,null,null,null,null,null,null,null,null,null,null,null,null,null,null,null,null,null,null,null,null,958]
[null,null,null,null,null,null,null,null,null,null,null,null,null,null,null,null,null,null,null,null,null,null,null,null,null,null,null,null,null,null,null,null,null,null,null,959]
[null,null,null,null,null,null,null,null,null,null,null,null,null,null,null,null,null,null,null,null,null,null,null,null,null,null,null,null,null,null,null,null,null,null,null,960]
[null,null,null,null,null,null,null,null,null,null,null,null,null,null,null,null,null,null,null,null,null,null,null,null,null,null,null,null,null,null,null,null,null,null,null,961]
[null,null,null,null,null,null,null,null,null,null,null,null,null,null,null,null,null,null,null,null,null,null,null,null,null,null,null,null,null,null,null,null,null,null,null,962]
[null,null,null,null,null,null,null,null,null,null,null,null,null,null,null,null,null,null,null,null,null,null,null,null,null,null,null,null,null,null,null,null,null,null,null,963]
[null,null,null,null,null,null,null,null,null,null,null,null,null,null,null,null,null,null,null,null,null,null,null,null,null,null,null,null,null,null,null,null,null,null,null,964]
[null,null,null,null,null,null,null,null,null,null,null,null,null,null,null,null,null,null,null,null,null,null,null,null,null,null,null,null,null,null,null,null,null,null,null,965]
[null,null,null,null,null,null,null,null,null,null,null,null,null,null,null,null,null,null,null,null,null,null,null,null,null,null,null,null,null,null,null,null,null,null,null,966]
[null,null,null,null,null,null,null,null,null,null,null,null,null,null,null,null,null,null,null,null,null,null,null,null,null,null,null,null,null,null,null,null,null,null,null,967]
[null,null,null,null,null,null,null,null,null,null,null,null,null,null,null,null,null,null,null,null,null,null,null,null,null,null,null,null,null,null,null,null,null,null,null,968]
[null,null,null,null,null,null,null,null,null,null,null,null,null,null,null,null,null,null,null,null,null,null,null,null,null,null,null,null,null,null,null,null,null,null,null,969]
[null,null,null,null,null,null,null,null,null,null,null,null,null,null,null,null,null,null,null,null,null,null,null,null,null,null,null,null,null,null,null,null,null,null,null,970]
[null,null,null,null,null,null,null,null,null,null,null,null,null,null,null,null,null,null,null,null,null,null,null,null,null,null,null,null,null,null,null,null,null,null,null,971]
[null,null,null,null,null,null,null,null,null,null,null,null,null,null,null,null,null,null,null,null,null,null,null,null,null,null,null,null,null,null,null,null,null,null,null,972]
[null,null,null,null,null,null,null,null,null,null,null,null,null,null,null,null,null,null,null,null,null,null,null,null,null,null,null,null,null,null,null,null,null,null,null,973]
[null,null,null,null,null,null,null,null,null,null,null,null,null,null,null,null,null,null,null,null,null,null,null,null,null,null,null,null,null,null,null,null,null,null,null,974]
[null,null,null,null,null,null,null,null,null,null,null,null,null,null,null,null,null,null,null,null,null,null,null,null,null,null,null,null,null,null,null,null,null,null,null,975]
[null,null,null,null,null,null,null,null,null,null,null,null,null,null,null,null,null,null,null,null,null,null,null,null,null,null,null,null,null,null,null,null,null,null,null,976]
[null,null,null,null,null,null,null,null,null,null,null,null,null,null,null,null,null,null,null,null,null,null,null,null,null,null,null,null,null,null,null,null,null,null,null,977]
[null,null,null,null,null,null,null,null,null,null,null,null,null,null,null,null,null,null,null,null,null,null,null,null,null,null,null,null,null,null,null,null,null,null,null,978]
[null,null,null,null,null,null,null,null,null,null,null,null,null,null,null,null,null,null,null,null,null,null,null,null,null,null,null,null,null,null,null,null,null,null,null,979]
[null,null,null,null,null,null,null,null,null,null,null,null,null,null,null,null,null,null,null,null,null,null,null,null,null,null,null,null,null,null,null,null,null,null,null,980]
[null,null,null,null,null,null,null,null,null,null,null,null,null,null,null,null,null,null,null,null,null,null,null,null,null,null,null,null,null,null,null,null,null,null,null,981]
[null,null,null,null,null,null,null,null,null,null,null,null,null,null,null,null,null,null,null,null,null,null,null,null,null,null,null,null,null,null,null,null,null,null,null,982]
[null,null,null,null,null,null,null,null,null,null,null,null,null,null,null,null,null,null,null,null,null,null,null,null,null,null,null,null,null,null,null,null,null,null,null,983]
[null,null,null,null,null,null,null,null,null,null,null,null,null,null,null,null,null,null,null,null,null,null,null,null,null,null,null,null,null,null,null,null,null,null,null,984]
[null,null,null,null,null,null,null,null,null,null,null,null,null,null,null,null,null,null,null,null,null,null,null,null,null,null,null,null,null,null,null,null,null,null,null,985]
[null,null,null,null,null,null,null,null,null,null,null,null,null,null,null,null,null,null,null,null,null,null,null,null,null,null,null,null,null,null,null,null,null,null,null,986]
[null,null,null,null,null,null,null,null,null,null,null,null,null,null,null,null,null,null,null,null,null,null,null,null,null,null,null,null,null,null,null,null,null,null,null,987]
[null,null,null,null,null,null,null,null,null,null,null,null,null,null,null,null,null,null,null,null,null,null,null,null,null,null,null,null,null,null,null,null,null,null,null,988]
[null,null,null,null,null,null,null,null,null,null,null,null,null,null,null,null,null,null,null,null,null,null,null,null,null,null,null,null,null,null,null,null,null,null,null,989]
[null,null,null,null,null,null,null,null,null,null,null,null,null,null,null,null,null,null,null,null,null,null,null,null,null,null,null,null,null,null,null,null,null,null,null,990]
[null,null,null,null,null,null,null,null,null,null,null,null,null,null,null,null,null,null,null,null,null,null,null,null,null,null,null,null,null,null,null,null,null,null,null,991]
[null,null,null,null,null,null,null,null,null,null,null,null,null,null,null,null,null,null,null,null,null,null,null,null,null,null,null,null,null,null,null,null,null,null,null,992]
[null,null,null,null,null,null,null,null,null,null,null,null,null,null,null,null,null,null,null,null,null,null,null,null,null,null,null,null,null,null,null,null,null,null,null,993]
[null,null,null,null,null,null,null,null,null,null,null,null,null,null,null,null,null,null,null,null,null,null,null,null,null,null,null,null,null,null,null,null,null,null,null,994]
[null,null,null,null,null,null,null,null,null,null,null,null,null,null,null,null,null,null,null,null,null,null,null,null,null,null,null,null,null,null,null,null,null,null,null,995]
[null,null,null,null,null,null,null,null,null,null,null,null,null,null,null,null,null,null,null,null,null,null,null,null,null,null,null,null,null,null,null,null,null,null,null,996]
[null,null,null,null,null,null,null,null,null,null,null,null,null,null,null,null,null,null,null,null,null,null,null,null,null,null,null,null,null,null,null,null,null,null,null,997]
[null,null,null,null,null,null,null,null,null,null,null,null,null,null,null,null,null,null,null,null,null,null,null,null,null,null,null,null,null,null,null,null,null,null,null,998]

{"sheet":"Result Class 6","index":3,"n_rows":29,"n_cols":35,"rows_kept":29,"cut":false,"hidden":false,"merged":[[2,0,3,0],[2,1,3,1],[2,2,3,2],[2,3,2,5],[2,6,2,8],[2,33,3,33],[2,34,3,34],[2,21,2,24],[2,25,2,28],[2,29,2,32],[2,9,2,11],[2,12,2,14],[2,15,2,17],[2,18,2,20],[0,2,0,23]]}
[null,null,"Annnual Result Sheet 2024-25 Class  6th"]
[]
["Sr. no","Name","Fahter Name","Punjabi",null,null,"Hindi",null,null,"English",null,null,"Mathematics",null,null,"Science",null,null,"Social Science",null,null,"Computer Sci.",null,null,null,"Physical",null,null,null,"Elective Sub",null,null,null,"Total Marks","Result"]
[null,null,null,"Th. ","CCE","Total","Th. ","CCE","Total","Th. ","CCE","Total","Th. ","CCE","Total","Th. ","CCE","Total","Th. ","CCE","Total","Th. ","CCE","Pract.","Total","Th. ","CCE","Pr","Total","Th. ","CCE","Pra.","Total"]
[]
[null,null,null,null,0,0,null,0,0,null,0,0,null,0,0,null,0,0,null,0,0,null,0,null,0,null,0,null,0,null,0,null,0,"---","----"]
[null,null,null,null,0,0,null,0,0,null,0,0,null,0,0,null,0,0,null,0,0,null,0,null,0,null,0,null,0,null,0,null,0,"---","----"]
[null,null,null,null,0,0,null,0,0,null,0,0,null,0,0,null,0,0,null,0,0,null,0,null,0,null,0,null,0,null,0,null,0,"---","----"]
[null,null,null,null,0,0,null,0,0,null,0,0,null,0,0,null,0,0,null,0,0,null,0,null,0,null,0,null,0,null,0,null,0,"---","----"]
[null,null,null,null,0,0,null,0,0,null,0,0,null,0,0,null,0,0,null,0,0,null,0,null,0,null,0,null,0,null,0,null,0,"---","----"]
[null,null,null,null,0,0,null,0,0,null,0,0,null,0,0,null,0,0,null,0,0,null,0,null,0,null,0,null,0,null,0,null,0,"---","----"]
[null,null,null,null,0,0,null,0,0,null,0,0,null,0,0,null,0,0,null,0,0,null,0,null,0,null,0,null,0,null,0,null,0,"---","----"]
[null,null,null,null,0,0,null,0,0,null,0,0,null,0,0,null,0,0,null,0,0,null,0,null,0,null,0,null,0,null,0,null,0,"---","----"]
[null,null,null,null,0,0,null,0,0,null,0,0,null,0,0,null,0,0,null,0,0,null,0,null,0,null,0,null,0,null,0,null,0,"---","----"]
[null,null,null,null,0,0,null,0,0,null,0,0,null,0,0,null,0,0,null,0,0,null,0,null,0,null,0,null,0,null,0,null,0,"---","----"]
[null,null,null,null,0,0,null,0,0,null,0,0,null,0,0,null,0,0,null,0,0,null,0,null,0,null,0,null,0,null,0,null,0,"---","----"]
[null,null,null,null,0,0,null,0,0,null,0,0,null,0,0,null,0,0,null,0,0,null,0,null,0,null,0,null,0,null,0,null,0,"---","----"]
[null,null,null,null,0,0,null,0,0,null,0,0,null,0,0,null,0,0,null,0,0,null,0,null,0,null,0,null,0,null,0,null,0,"---","----"]
[null,null,null,null,0,0,null,0,0,null,0,0,null,0,0,null,0,0,null,0,0,null,0,null,0,null,0,null,0,null,0,null,0,"---","----"]
[null,null,null,null,0,0,null,0,0,null,0,0,null,0,0,null,0,0,null,0,0,null,0,null,0,null,0,null,0,null,0,null,0,"---","----"]
[null,null,null,null,0,0,null,0,0,null,0,0,null,0,0,null,0,0,null,0,0,null,0,null,0,null,0,null,0,null,0,null,0,"---","----"]
[null,null,null,null,0,0,null,0,0,null,0,0,null,0,0,null,0,0,null,0,0,null,0,null,0,null,0,null,0,null,0,null,0,"---","----"]
[null,null,null,null,0,0,null,0,0,null,0,0,null,0,0,null,0,0,null,0,0,null,0,null,0,null,0,null,0,null,0,null,0,"---","----"]
[null,null,null,null,0,0,null,0,0,null,0,0,null,0,0,null,0,0,null,0,0,null,0,null,0,null,0,null,0,null,0,null,0,"---","----"]
[null,null,null,null,0,0,null,0,0,null,0,0,null,0,0,null,0,0,null,0,0,null,0,null,0,null,0,null,0,null,0,null,0,"---","----"]
[null,null,null,null,0,0,null,0,0,null,0,0,null,0,0,null,0,0,null,0,0,null,0,null,0,null,0,null,0,null,0,null,0,"---","----"]
[null,null,null,null,0,0,null,0,0,null,0,0,null,0,0,null,0,0,null,0,0,null,0,null,0,null,0,null,0,null,0,null,0,"---","----"]
[null,null,null,null,0,0,null,0,0,null,0,0,null,0,0,null,0,0,null,0,0,null,0,null,0,null,0,null,0,null,0,null,0,"---","----"]
[null,null,null,null,0,0,null,0,0,null,0,0,null,0,0,null,0,0,null,0,0,null,0,null,0,null,0,null,0,null,0,null,0,"---","----"]

{"sheet":"Result Class 7","index":4,"n_rows":29,"n_cols":35,"rows_kept":29,"cut":false,"hidden":false,"merged":[[2,25,2,28],[2,29,2,32],[2,33,3,33],[2,34,3,34],[0,2,0,23],[2,9,2,11],[2,12,2,14],[2,15,2,17],[2,18,2,20],[2,21,2,24],[2,0,3,0],[2,1,3,1],[2,2,3,2],[2,3,2,5],[2,6,2,8]]}
[null,null,"Annnual Result Sheet 2024-25 Class  7th"]
[]
["Sr. no","Name","Fahter Name","Punjabi",null,null,"Hindi",null,null,"English",null,null,"Mathematics",null,null,"Science",null,null,"Social Science",null,null,"Computer Sci.",null,null,null,"Physical",null,null,null,"Elective Sub",null,null,null,"Total Marks","Result"]
[null,null,null,"Th. ","CCE","Total","Th. ","CCE","Total","Th. ","CCE","Total","Th. ","CCE","Total","Th. ","CCE","Total","Th. ","CCE","Total","Th. ","CCE","Pract.","Total","Th. ","CCE","Pr","Total","Th. ","CCE","Pra.","Total"]
[null,null,null,null,0,0,null,0,0,null,0,0,null,0,0,null,0,0,null,0,0,null,0,null,0,null,0,null,0,null,0,null,0,"---","----"]
[null,null,null,null,0,0,null,0,0,null,0,0,null,0,0,null,0,0,null,0,0,null,0,null,0,null,0,null,0,null,0,null,0,"---","----"]
[null,null,null,null,0,0,null,0,0,null,0,0,null,0,0,null,0,0,null,0,0,null,0,null,0,null,0,null,0,null,0,null,0,"---","----"]
[null,null,null,null,0,0,null,0,0,null,0,0,null,0,0,null,0,0,null,0,0,null,0,null,0,null,0,null,0,null,0,null,0,"---","----"]
[null,null,null,null,0,0,null,0,0,null,0,0,null,0,0,null,0,0,null,0,0,null,0,null,0,null,0,null,0,null,0,null,0,"---","----"]
[null,null,null,null,0,0,null,0,0,null,0,0,null,0,0,null,0,0,null,0,0,null,0,null,0,null,0,null,0,null,0,null,0,"---","----"]
[null,null,null,null,0,0,null,0,0,null,0,0,null,0,0,null,0,0,null,0,0,null,0,null,0,null,0,null,0,null,0,null,0,"---","----"]
[null,null,null,null,0,0,null,0,0,null,0,0,null,0,0,null,0,0,null,0,0,null,0,null,0,null,0,null,0,null,0,null,0,"---","----"]
[null,null,null,null,0,0,null,0,0,null,0,0,null,0,0,null,0,0,null,0,0,null,0,null,0,null,0,null,0,null,0,null,0,"---","----"]
[null,null,null,null,0,0,null,0,0,null,0,0,null,0,0,null,0,0,null,0,0,null,0,null,0,null,0,null,0,null,0,null,0,"---","----"]
[null,null,null,null,0,0,null,0,0,null,0,0,null,0,0,null,0,0,null,0,0,null,0,null,0,null,0,null,0,null,0,null,0,"---","----"]
[null,null,null,null,0,0,null,0,0,null,0,0,null,0,0,null,0,0,null,0,0,null,0,null,0,null,0,null,0,null,0,null,0,"---","----"]
[null,null,null,null,0,0,null,0,0,null,0,0,null,0,0,null,0,0,null,0,0,null,0,null,0,null,0,null,0,null,0,null,0,"---","----"]
[null,null,null,null,0,0,null,0,0,null,0,0,null,0,0,null,0,0,null,0,0,null,0,null,0,null,0,null,0,null,0,null,0,"---","----"]
[null,null,null,null,0,0,null,0,0,null,0,0,null,0,0,null,0,0,null,0,0,null,0,null,0,null,0,null,0,null,0,null,0,"---","----"]
[null,null,null,null,0,0,null,0,0,null,0,0,null,0,0,null,0,0,null,0,0,null,0,null,0,null,0,null,0,null,0,null,0,"---","----"]
[null,null,null,null,0,0,null,0,0,null,0,0,null,0,0,null,0,0,null,0,0,null,0,null,0,null,0,null,0,null,0,null,0,"---","----"]
[null,null,null,null,0,0,null,0,0,null,0,0,null,0,0,null,0,0,null,0,0,null,0,null,0,null,0,null,0,null,0,null,0,"---","----"]
[null,null,null,null,0,0,null,0,0,null,0,0,null,0,0,null,0,0,null,0,0,null,0,null,0,null,0,null,0,null,0,null,0,"---","----"]
[null,null,null,null,0,0,null,0,0,null,0,0,null,0,0,null,0,0,null,0,0,null,0,null,0,null,0,null,0,null,0,null,0,"---","----"]
[null,null,null,null,0,0,null,0,0,null,0,0,null,0,0,null,0,0,null,0,0,null,0,null,0,null,0,null,0,null,0,null,0,"---","----"]
[null,null,null,null,0,0,null,0,0,null,0,0,null,0,0,null,0,0,null,0,0,null,0,null,0,null,0,null,0,null,0,null,0,"---","----"]
[null,null,null,null,0,0,null,0,0,null,0,0,null,0,0,null,0,0,null,0,0,null,0,null,0,null,0,null,0,null,0,null,0,"---","----"]
[null,null,null,null,0,0,null,0,0,null,0,0,null,0,0,null,0,0,null,0,0,null,0,null,0,null,0,null,0,null,0,null,0,"---","----"]
[null,null,null,null,0,0,null,0,0,null,0,0,null,0,0,null,0,0,null,0,0,null,0,null,0,null,0,null,0,null,0,null,0,"---","----"]